BDBM256036 US9481672, 217
SMILES: CC(C)n1c2cc(ccc2n(C)c1=O)-n1cc(C(O)=O)c(=O)n([C@@H]2CCc3c2cccc3C(F)(F)F)c1=O
InChI Key: InChIKey=ADNAVRIGWAGVCT-LJQANCHMSA-N
Data: 1 IC50
Activity Spreadsheet -- Enzyme Inhibition Constant Data from BindingDB
Found 1 hit for monomerid = 256036
Trg + Lig
Ki
nM
ΔG°
kcal/mole
IC50
nM
Kd
nM
EC50/IC50
nM
koff
s-1
kon
M-1s-1
pHTemp
°C
Chymase
(Mesocricetus auratus (Golden hamster))
BDBM256036
(US9481672, 217)
Show SMILES CC(C)n1c2cc(ccc2n(C)c1=O)-n1cc(C(O)=O)c(=O)n([C@@H]2CCc3c2cccc3C(F)(F)F)c1=O |r|
Show InChI InChI=1S/C26H23F3N4O5/c1-13(2)32-21-11-14(7-9-20(21)30(3)24(32)37)31-12-17(23(35)36)22(34)33(25(31)38)19-10-8-15-16(19)5-4-6-18(15)26(27,28)29/h4-7,9,11-13,19H,8,10H2,1-3H3,(H,35,36)/t19-/m1/s1
US Patent
n/an/a 1n/an/an/an/a7.5n/a
Bayer Pharma Aktiengesellschaft
US Patent
Assay Description
The enzyme source used is recombinant human chymase (expressed in HEK293 cells) or chymase purified from hamsters' tongues. The substrate used for ch...
US Patent US9481672 (2016)
BindingDB Entry DOI: 10.7270/Q20P0XZ7