BDBM25618 (1Z)-5-[3-(pyridin-4-yl)-1H-pyrazol-4-yl]-2,3-dihydro-1H-indene-1-hydroxylamine::pyrazole-based inhibitor, 1
SMILES: O=NC1CCc2cc(ccc12)-c1c[nH]nc1-c1ccncc1
InChI Key: InChIKey=QXXGBIGYGBFXEV-UHFFFAOYSA-N
Data: 1 IC50
Activity Spreadsheet -- Enzyme Inhibition Constant Data from BindingDB
Found 1 hit for monomerid = 25618
Trg + Lig
Ki
nM
ΔG°
kcal/mole
IC50
nM
Kd
nM
EC50/IC50
nM
koff
s-1
kon
M-1s-1
pHTemp
°C
Serine/threonine-protein kinase B-raf
(Homo sapiens (Human))
BDBM25618
((1Z)-5-[3-(pyridin-4-yl)-1H-pyrazol-4-yl]-2,3-dihy...)
Show SMILES O=NC1CCc2cc(ccc12)-c1c[nH]nc1-c1ccncc1
Show InChI InChI=1S/C17H14N4O/c22-21-16-4-2-12-9-13(1-3-14(12)16)15-10-19-20-17(15)11-5-7-18-8-6-11/h1,3,5-10,16H,2,4H2,(H,19,20)
NCI pathway
Reactome pathway
n/an/a 0.150n/an/an/an/a7.222
Array BioPharma
Assay Description
Activity of human recombinant B-Raf protein was assessed in vitro by assay of the incorporation of radiolabeled phosphate to recombinant MAP kinase (...
Bioorg Med Chem Lett 18: 4692-5 (2008)
Article DOI: 10.1016/j.bmcl.2008.07.002
BindingDB Entry DOI: 10.7270/Q2NK3CBJ