BDBM256349 US9487490, 2A
SMILES: COC1CN(C1)C(=O)c1ccc2c(nn(C(=O)c3c(Cl)cccc3C3CC3)c2c1)C1=CC[C@@H](CC1)C(O)=O
InChI Key: InChIKey=LELXANQYKFVMDB-SFHVURJKSA-N
Data: 1 IC50
Activity Spreadsheet -- Enzyme Inhibition Constant Data from BindingDB
Found 1 hit for monomerid = 256349
Trg + Lig
Ki
nM
ΔG°
kcal/mole
IC50
nM
Kd
nM
EC50/IC50
nM
koff
s-1
kon
M-1s-1
pHTemp
°C
Isoform 2 of Nuclear receptor ROR-gamma
(Homo sapiens (Human))
BDBM256349
(US9487490, 2A)
Show SMILES COC1CN(C1)C(=O)c1ccc2c(nn(C(=O)c3c(Cl)cccc3C3CC3)c2c1)C1=CC[C@@H](CC1)C(O)=O |r,t:34|
Show InChI InChI=1S/C29H28ClN3O5/c1-38-20-14-32(15-20)27(34)19-11-12-22-24(13-19)33(31-26(22)17-7-9-18(10-8-17)29(36)37)28(35)25-21(16-5-6-16)3-2-4-23(25)30/h2-4,7,11-13,16,18,20H,5-6,8-10,14-15H2,1H3,(H,36,37)/t18-/m0/s1
US Patent
n/an/a 2n/an/an/an/a7.04
Merck Sharp & Dohme Corp.
US Patent
Assay Description
To identify novel antagonists of RORgammaT, an assay was developed which employs the interaction of RORgammaT with its co-activator peptide SRC1_2. T...
US Patent US9487490 (2016)
BindingDB Entry DOI: 10.7270/Q2GQ6WQN