BDBM256357 US9487490, 4E
SMILES: COC1CN(C1)C(=O)c1ccc2c(nn(C(=O)c3c(Cl)cccc3C(F)(F)F)c2c1)C1=CCC(CC1)C(O)=O
InChI Key: InChIKey=GMWBIQXNRGCABM-UHFFFAOYSA-N
Data: 1 IC50
Activity Spreadsheet -- Enzyme Inhibition Constant Data from BindingDB
Found 1 hit for monomerid = 256357
Trg + Lig
Ki
nM
ΔG°
kcal/mole
IC50
nM
Kd
nM
EC50/IC50
nM
koff
s-1
kon
M-1s-1
pHTemp
°C
Isoform 2 of Nuclear receptor ROR-gamma
(Homo sapiens (Human))
BDBM256357
(US9487490, 4E)
Show SMILES COC1CN(C1)C(=O)c1ccc2c(nn(C(=O)c3c(Cl)cccc3C(F)(F)F)c2c1)C1=CCC(CC1)C(O)=O |t:34|
Show InChI InChI=1S/C27H23ClF3N3O5/c1-39-17-12-33(13-17)24(35)16-9-10-18-21(11-16)34(32-23(18)14-5-7-15(8-6-14)26(37)38)25(36)22-19(27(29,30)31)3-2-4-20(22)28/h2-5,9-11,15,17H,6-8,12-13H2,1H3,(H,37,38)
US Patent
n/an/a 2n/an/an/an/a7.04
Merck Sharp & Dohme Corp.
US Patent
Assay Description
To identify novel antagonists of RORgammaT, an assay was developed which employs the interaction of RORgammaT with its co-activator peptide SRC1_2. T...
US Patent US9487490 (2016)
BindingDB Entry DOI: 10.7270/Q2GQ6WQN