BDBM25636 (1Z)-5-[1-(piperidin-4-yl)-3-(pyridin-4-yl)-1H-pyrazol-4-yl]-2,3-dihydro-1H-indene-1-hydroxylamine::pyrazole based inhibitor, 18
SMILES: O=NC1CCc2cc(ccc12)-c1cn(nc1-c1ccncc1)C1CCNCC1
InChI Key: InChIKey=RCDPVKCEMFLESQ-UHFFFAOYSA-N
Data: 1 IC50
Activity Spreadsheet -- Enzyme Inhibition Constant Data from BindingDB
Found 1 hit for monomerid = 25636
Trg + Lig
Ki
nM
ΔG°
kcal/mole
IC50
nM
Kd
nM
EC50/IC50
nM
koff
s-1
kon
M-1s-1
pHTemp
°C
Serine/threonine-protein kinase B-raf
(Homo sapiens (Human))
BDBM25636
((1Z)-5-[1-(piperidin-4-yl)-3-(pyridin-4-yl)-1H-pyr...)
Show SMILES O=NC1CCc2cc(ccc12)-c1cn(nc1-c1ccncc1)C1CCNCC1
Show InChI InChI=1S/C22H23N5O/c28-26-21-4-2-16-13-17(1-3-19(16)21)20-14-27(18-7-11-24-12-8-18)25-22(20)15-5-9-23-10-6-15/h1,3,5-6,9-10,13-14,18,21,24H,2,4,7-8,11-12H2
NCI pathway
Reactome pathway
n/an/a 0.0300n/an/an/an/a7.222
Array BioPharma
Assay Description
Activity of human recombinant B-Raf protein was assessed in vitro by assay of the incorporation of radiolabeled phosphate to recombinant MAP kinase (...
Bioorg Med Chem Lett 18: 4692-5 (2008)
Article DOI: 10.1016/j.bmcl.2008.07.002
BindingDB Entry DOI: 10.7270/Q2NK3CBJ