BDBM256361 US9487490, 4I
SMILES: COC1CCN(C1)C(=O)c1ccc2c(nn(C(=O)c3c(Cl)cccc3C(F)(F)F)c2c1)C1=CCC(CC1)C(O)=O
InChI Key: InChIKey=YBBWSYMSKCZLKW-UHFFFAOYSA-N
Data: 1 IC50
Activity Spreadsheet -- Enzyme Inhibition Constant Data from BindingDB
Found 1 hit for monomerid = 256361
Trg + Lig
Ki
nM
ΔG°
kcal/mole
IC50
nM
Kd
nM
EC50/IC50
nM
koff
s-1
kon
M-1s-1
pHTemp
°C
Isoform 2 of Nuclear receptor ROR-gamma
(Homo sapiens (Human))
BDBM256361
(US9487490, 4I)
Show SMILES COC1CCN(C1)C(=O)c1ccc2c(nn(C(=O)c3c(Cl)cccc3C(F)(F)F)c2c1)C1=CCC(CC1)C(O)=O |t:35|
Show InChI InChI=1S/C28H25ClF3N3O5/c1-40-18-11-12-34(14-18)25(36)17-9-10-19-22(13-17)35(33-24(19)15-5-7-16(8-6-15)27(38)39)26(37)23-20(28(30,31)32)3-2-4-21(23)29/h2-5,9-10,13,16,18H,6-8,11-12,14H2,1H3,(H,38,39)
US Patent
n/an/a 3n/an/an/an/a7.04
Merck Sharp & Dohme Corp.
US Patent
Assay Description
To identify novel antagonists of RORgammaT, an assay was developed which employs the interaction of RORgammaT with its co-activator peptide SRC1_2. T...
US Patent US9487490 (2016)
BindingDB Entry DOI: 10.7270/Q2GQ6WQN