BDBM256364 US9487490, 4L
SMILES: OC(=O)C1CCC(=CC1)c1nn(C(=O)c2c(Cl)cccc2C(F)(F)F)c2cc(ccc12)C(=O)N1CCOCC1
InChI Key: InChIKey=DSBPXNGBDIGBRF-UHFFFAOYSA-N
Data: 1 IC50
Activity Spreadsheet -- Enzyme Inhibition Constant Data from BindingDB
Found 1 hit for monomerid = 256364
Trg + Lig
Ki
nM
ΔG°
kcal/mole
IC50
nM
Kd
nM
EC50/IC50
nM
koff
s-1
kon
M-1s-1
pHTemp
°C
Isoform 2 of Nuclear receptor ROR-gamma
(Homo sapiens (Human))
BDBM256364
(US9487490, 4L)
Show SMILES OC(=O)C1CCC(=CC1)c1nn(C(=O)c2c(Cl)cccc2C(F)(F)F)c2cc(ccc12)C(=O)N1CCOCC1 |c:6|
Show InChI InChI=1S/C27H23ClF3N3O5/c28-20-3-1-2-19(27(29,30)31)22(20)25(36)34-21-14-17(24(35)33-10-12-39-13-11-33)8-9-18(21)23(32-34)15-4-6-16(7-5-15)26(37)38/h1-4,8-9,14,16H,5-7,10-13H2,(H,37,38)
US Patent
n/an/a 36n/an/an/an/a7.04
Merck Sharp & Dohme Corp.
US Patent
Assay Description
To identify novel antagonists of RORgammaT, an assay was developed which employs the interaction of RORgammaT with its co-activator peptide SRC1_2. T...
US Patent US9487490 (2016)
BindingDB Entry DOI: 10.7270/Q2GQ6WQN