BDBM25637 (1Z)-5-[1-(1-methylpiperidin-4-yl)-3-(pyridin-4-yl)-1H-pyrazol-4-yl]-2,3-dihydro-1H-indene-1-hydroxylamine::pyrazole based inhibitor, 19
SMILES: CN1CCC(CC1)n1cc(c(n1)-c1ccncc1)-c1ccc2C(CCc2c1)N=O
InChI Key: InChIKey=DJXMCIWYEITNAK-UHFFFAOYSA-N
Data: 1 IC50
Activity Spreadsheet -- Enzyme Inhibition Constant Data from BindingDB
Found 1 hit for monomerid = 25637
Trg + Lig
Ki
nM
ΔG°
kcal/mole
IC50
nM
Kd
nM
EC50/IC50
nM
koff
s-1
kon
M-1s-1
pHTemp
°C
Serine/threonine-protein kinase B-raf
(Homo sapiens (Human))
BDBM25637
((1Z)-5-[1-(1-methylpiperidin-4-yl)-3-(pyridin-4-yl...)
Show SMILES CN1CCC(CC1)n1cc(c(n1)-c1ccncc1)-c1ccc2C(CCc2c1)N=O
Show InChI InChI=1S/C23H25N5O/c1-27-12-8-19(9-13-27)28-15-21(23(25-28)16-6-10-24-11-7-16)18-2-4-20-17(14-18)3-5-22(20)26-29/h2,4,6-7,10-11,14-15,19,22H,3,5,8-9,12-13H2,1H3
NCI pathway
Reactome pathway
n/an/a 0.340n/an/an/an/a7.222
Array BioPharma
Assay Description
Activity of human recombinant B-Raf protein was assessed in vitro by assay of the incorporation of radiolabeled phosphate to recombinant MAP kinase (...
Bioorg Med Chem Lett 18: 4692-5 (2008)
Article DOI: 10.1016/j.bmcl.2008.07.002
BindingDB Entry DOI: 10.7270/Q2NK3CBJ