BDBM256370 US9487490, 4R
SMILES: C[C@H]1CN(CCO1)C(=O)c1ccc2c(nn(C(=O)c3c(Cl)cccc3C(F)(F)F)c2c1)C1=CCC(CC1)C(O)=O
InChI Key: InChIKey=DDQRUXMBXOJJAC-MYJWUSKBSA-N
Data: 1 IC50
Activity Spreadsheet -- Enzyme Inhibition Constant Data from BindingDB
Found 1 hit for monomerid = 256370
Trg + Lig
Ki
nM
ΔG°
kcal/mole
IC50
nM
Kd
nM
EC50/IC50
nM
koff
s-1
kon
M-1s-1
pHTemp
°C
Isoform 2 of Nuclear receptor ROR-gamma
(Homo sapiens (Human))
BDBM256370
(US9487490, 4R)
Show SMILES C[C@H]1CN(CCO1)C(=O)c1ccc2c(nn(C(=O)c3c(Cl)cccc3C(F)(F)F)c2c1)C1=CCC(CC1)C(O)=O |r,t:35|
Show InChI InChI=1S/C28H25ClF3N3O5/c1-15-14-34(11-12-40-15)25(36)18-9-10-19-22(13-18)35(33-24(19)16-5-7-17(8-6-16)27(38)39)26(37)23-20(28(30,31)32)3-2-4-21(23)29/h2-5,9-10,13,15,17H,6-8,11-12,14H2,1H3,(H,38,39)/t15-,17?/m0/s1
US Patent
n/an/a 21n/an/an/an/a7.04
Merck Sharp & Dohme Corp.
US Patent
Assay Description
To identify novel antagonists of RORgammaT, an assay was developed which employs the interaction of RORgammaT with its co-activator peptide SRC1_2. T...
US Patent US9487490 (2016)
BindingDB Entry DOI: 10.7270/Q2GQ6WQN