BDBM25643 (1Z)-5-[1-methyl-3-(pyridin-3-yl)-1H-pyrazol-4-yl]-2,3-dihydro-1H-indene-1-hydroxylamine::pyrazole-based inhibitor, 25
SMILES: Cn1cc(c(n1)-c1cccnc1)-c1ccc2C(CCc2c1)N=O
InChI Key: InChIKey=HVQGSGICKXGJFU-UHFFFAOYSA-N
Data: 1 IC50
Activity Spreadsheet -- Enzyme Inhibition Constant Data from BindingDB
Found 1 hit for monomerid = 25643
Trg + Lig
Ki
nM
ΔG°
kcal/mole
IC50
nM
Kd
nM
EC50/IC50
nM
koff
s-1
kon
M-1s-1
pHTemp
°C
Serine/threonine-protein kinase B-raf
(Homo sapiens (Human))
BDBM25643
((1Z)-5-[1-methyl-3-(pyridin-3-yl)-1H-pyrazol-4-yl]...)
Show SMILES Cn1cc(c(n1)-c1cccnc1)-c1ccc2C(CCc2c1)N=O
Show InChI InChI=1S/C18H16N4O/c1-22-11-16(18(20-22)14-3-2-8-19-10-14)13-4-6-15-12(9-13)5-7-17(15)21-23/h2-4,6,8-11,17H,5,7H2,1H3
NCI pathway
Reactome pathway
n/an/a 434n/an/an/an/a7.222
Array BioPharma
Assay Description
Activity of human recombinant B-Raf protein was assessed in vitro by assay of the incorporation of radiolabeled phosphate to recombinant MAP kinase (...
Bioorg Med Chem Lett 18: 4692-5 (2008)
Article DOI: 10.1016/j.bmcl.2008.07.002
BindingDB Entry DOI: 10.7270/Q2NK3CBJ