null
SMILES: Cn1cc(c(n1)-c1ccncc1)-c1ccc2C(NO)=NCc2c1
InChI Key: InChIKey=RXOAUTDNEHGRQR-UHFFFAOYSA-N
Activity Spreadsheet -- Enzyme Inhibition Constant Data from BindingDB
Found 1 hit for monomerid = 25649
Trg + Lig
Ki
nM
ΔG°
kcal/mole
IC50
nM
Kd
nM
EC50/IC50
nM
koff
s-1
kon
M-1s-1
pHTemp
°C
Serine/threonine-protein kinase B-raf
(Homo sapiens (Human))
BDBM25649
((1E)-5-[1-methyl-3-(pyridin-4-yl)-1H-pyrazol-4-yl]...)
Show SMILES Cn1cc(c(n1)-c1ccncc1)-c1ccc2C(NO)=NCc2c1 |c:20|
Show InChI InChI=1S/C17H15N5O/c1-22-10-15(16(20-22)11-4-6-18-7-5-11)12-2-3-14-13(8-12)9-19-17(14)21-23/h2-8,10,23H,9H2,1H3,(H,19,21)
NCI pathway
Reactome pathway
n/an/a<2n/an/an/an/an/an/a
Array BioPharma
Assay Description
Activity of human recombinant B-Raf protein was assessed in vitro by assay of the incorporation of radiolabeled phosphate to recombinant MAP kinase (...
Bioorg Med Chem Lett 18: 4692-5 (2008)
Article DOI: 10.1016/j.bmcl.2008.07.002
BindingDB Entry DOI: 10.7270/Q2NK3CBJ