BDBM256649 US10053456, 28::US10414761, Example 28::US10968213, Example 28::US9487511, 28::US9718814, 28::US9920047, 28
SMILES: FC1(F)CCC(CC1)NC(=O)c1cc(cs1)C1CC1NCC1CC1
InChI Key: InChIKey=PSYDXVRMASFGBH-UHFFFAOYSA-N
Data: 24 IC50
Activity Spreadsheet -- Enzyme Inhibition Constant Data from BindingDB
Found 24 hits for monomerid = 256649
Trg + Lig
Ki
nM
ΔG°
kcal/mole
IC50
nM
Kd
nM
EC50/IC50
nM
koff
s-1
kon
M-1s-1
pHTemp
°C
GST-Lysine-specific histone demethylase 1A (LSD1)
(Homo sapiens (Human))
BDBM256649
(US10053456, 28 | US10414761, Example 28 | US109682...)
Show SMILES FC1(F)CCC(CC1)NC(=O)c1cc(cs1)C1CC1NCC1CC1
Show InChI InChI=1S/C18H24F2N2OS/c19-18(20)5-3-13(4-6-18)22-17(23)16-7-12(10-24-16)14-8-15(14)21-9-11-1-2-11/h7,10-11,13-15,21H,1-6,8-9H2,(H,22,23)
US Patent
n/an/a<100n/an/an/an/a8.025
Takeda Pharmaceutical Company Limited
US Patent
Assay Description
A test compound dissolved in DMSO was added by to a reaction solution (50 mM Tris-HCl (pH 8.0), 0.1% BSA, 1 mM DTT) containing LSD1 enzyme, and the m...
US Patent US9487511 (2016)
BindingDB Entry DOI: 10.7270/Q2V123Q4
Amine oxidase [flavin-containing] B
(Homo sapiens (Human))
BDBM256649
(US10053456, 28 | US10414761, Example 28 | US109682...)
Show SMILES FC1(F)CCC(CC1)NC(=O)c1cc(cs1)C1CC1NCC1CC1
Show InChI InChI=1S/C18H24F2N2OS/c19-18(20)5-3-13(4-6-18)22-17(23)16-7-12(10-24-16)14-8-15(14)21-9-11-1-2-11/h7,10-11,13-15,21H,1-6,8-9H2,(H,22,23)
US Patent
n/an/a>1.00E+5n/an/an/an/an/an/a
Takeda Pharmaceutical Company Limited
US Patent
Assay Description
The MAO-B inhibitory activity evaluation described below followed the protocol of MAO-Glo (registered trademark) Assay of Promega KK.A test compound ...
US Patent US10968213 (2021)
Amine oxidase [flavin-containing] B
(Homo sapiens (Human))
BDBM256649
(US10053456, 28 | US10414761, Example 28 | US109682...)
Show SMILES FC1(F)CCC(CC1)NC(=O)c1cc(cs1)C1CC1NCC1CC1
Show InChI InChI=1S/C18H24F2N2OS/c19-18(20)5-3-13(4-6-18)22-17(23)16-7-12(10-24-16)14-8-15(14)21-9-11-1-2-11/h7,10-11,13-15,21H,1-6,8-9H2,(H,22,23)
US Patent
n/an/a>1.00E+5n/an/an/an/a7.525
Takeda Pharmaceutical Company Limited
US Patent
Assay Description
The MAO-B inhibitory activity evaluation described below followed the protocol of MAO-Glo (registered trademark) Assay of Promega KK. A test compound...
US Patent US9487511 (2016)
BindingDB Entry DOI: 10.7270/Q2V123Q4
Lysine-specific histone demethylase 1A
(Homo sapiens (Human))
BDBM256649
(US10053456, 28 | US10414761, Example 28 | US109682...)
Show SMILES FC1(F)CCC(CC1)NC(=O)c1cc(cs1)C1CC1NCC1CC1
Show InChI InChI=1S/C18H24F2N2OS/c19-18(20)5-3-13(4-6-18)22-17(23)16-7-12(10-24-16)14-8-15(14)21-9-11-1-2-11/h7,10-11,13-15,21H,1-6,8-9H2,(H,22,23)
Reactome pathway
US Patent
n/an/a<100n/an/an/an/a8.025
Takeda Pharmaceutical Company Limited
US Patent
Assay Description
A test compound dissolved in DMSO was added by to a reaction solution (50 mM Tris-HCl (pH 8.0), 0.1% BSA, 1 mM DTT) containing LSD1 enzyme, and the m...
US Patent US9718814 (2017)
BindingDB Entry DOI: 10.7270/Q21838J9
Amine oxidase (flavin-containing) A
(Homo sapiens (Human))
BDBM256649
(US10053456, 28 | US10414761, Example 28 | US109682...)
Show SMILES FC1(F)CCC(CC1)NC(=O)c1cc(cs1)C1CC1NCC1CC1
Show InChI InChI=1S/C18H24F2N2OS/c19-18(20)5-3-13(4-6-18)22-17(23)16-7-12(10-24-16)14-8-15(14)21-9-11-1-2-11/h7,10-11,13-15,21H,1-6,8-9H2,(H,22,23)
US Patent
n/an/a>1.00E+5n/an/an/an/a7.525
Takeda Pharmaceutical Company Limited
US Patent
Assay Description
A test compound dissolved in DMSO was added to a reaction solution (100 mM HEPES (pH 7.5), 5% glycerol) containing MAO-A enzyme (Sigma-Aldrich Co. LL...
US Patent US9718814 (2017)
BindingDB Entry DOI: 10.7270/Q21838J9
Amine oxidase [flavin-containing] B
(Homo sapiens (Human))
BDBM256649
(US10053456, 28 | US10414761, Example 28 | US109682...)
Show SMILES FC1(F)CCC(CC1)NC(=O)c1cc(cs1)C1CC1NCC1CC1
Show InChI InChI=1S/C18H24F2N2OS/c19-18(20)5-3-13(4-6-18)22-17(23)16-7-12(10-24-16)14-8-15(14)21-9-11-1-2-11/h7,10-11,13-15,21H,1-6,8-9H2,(H,22,23)
US Patent
n/an/a>1.00E+5n/an/an/an/a7.525
Takeda Pharmaceutical Company Limited
US Patent
Assay Description
A test compound dissolved in DMSO was added to a reaction solution (100 mM HEPES (pH 7.5), 5% glycerol, 10% DMSO) containing MAO-B enzyme (Sigma-Aldr...
US Patent US9718814 (2017)
BindingDB Entry DOI: 10.7270/Q21838J9
Lysine-specific histone demethylase 1A
(Homo sapiens (Human))
BDBM256649
(US10053456, 28 | US10414761, Example 28 | US109682...)
Show SMILES FC1(F)CCC(CC1)NC(=O)c1cc(cs1)C1CC1NCC1CC1
Show InChI InChI=1S/C18H24F2N2OS/c19-18(20)5-3-13(4-6-18)22-17(23)16-7-12(10-24-16)14-8-15(14)21-9-11-1-2-11/h7,10-11,13-15,21H,1-6,8-9H2,(H,22,23)
Reactome pathway
US Patent
n/an/a<100n/an/an/an/a8.025
Takeda Pharmaceutical Company Limited
US Patent
Assay Description
A test compound dissolved in DMSO was added by to a reaction solution (50 mM Tris-HCl (pH 8.0), 0.1% BSA, 1 mM DTT) containing LSD1 enzyme, and the m...
US Patent US9714241 (2017)
BindingDB Entry DOI: 10.7270/Q2QZ2CZN
Amine oxidase (flavin-containing) A
(Homo sapiens (Human))
BDBM256649
(US10053456, 28 | US10414761, Example 28 | US109682...)
Show SMILES FC1(F)CCC(CC1)NC(=O)c1cc(cs1)C1CC1NCC1CC1
Show InChI InChI=1S/C18H24F2N2OS/c19-18(20)5-3-13(4-6-18)22-17(23)16-7-12(10-24-16)14-8-15(14)21-9-11-1-2-11/h7,10-11,13-15,21H,1-6,8-9H2,(H,22,23)
US Patent
n/an/a>1.00E+5n/an/an/an/a7.525
Takeda Pharmaceutical Company Limited
US Patent
Assay Description
The MAO-A inhibitory activity evaluation described below followed the protocol of MAO-Glo (registered trademark) Assay of Promega KK.A test compound ...
US Patent US9714241 (2017)
BindingDB Entry DOI: 10.7270/Q2QZ2CZN
Amine oxidase [flavin-containing] B
(Homo sapiens (Human))
BDBM256649
(US10053456, 28 | US10414761, Example 28 | US109682...)
Show SMILES FC1(F)CCC(CC1)NC(=O)c1cc(cs1)C1CC1NCC1CC1
Show InChI InChI=1S/C18H24F2N2OS/c19-18(20)5-3-13(4-6-18)22-17(23)16-7-12(10-24-16)14-8-15(14)21-9-11-1-2-11/h7,10-11,13-15,21H,1-6,8-9H2,(H,22,23)
US Patent
n/an/a>1.00E+5n/an/an/an/a7.525
Takeda Pharmaceutical Company Limited
US Patent
Assay Description
The MAO-B inhibitory activity evaluation described below followed the protocol of MAO-Glo (registered trademark) Assay of Promega KK.A test compound ...
US Patent US9714241 (2017)
BindingDB Entry DOI: 10.7270/Q2QZ2CZN
Lysine-specific histone demethylase 1A
(Homo sapiens (Human))
BDBM256649
(US10053456, 28 | US10414761, Example 28 | US109682...)
Show SMILES FC1(F)CCC(CC1)NC(=O)c1cc(cs1)C1CC1NCC1CC1
Show InChI InChI=1S/C18H24F2N2OS/c19-18(20)5-3-13(4-6-18)22-17(23)16-7-12(10-24-16)14-8-15(14)21-9-11-1-2-11/h7,10-11,13-15,21H,1-6,8-9H2,(H,22,23)
Reactome pathway
US Patent
n/an/a 680n/an/an/an/a8.025
Takeda Pharmaceutical Company Limited
US Patent
Assay Description
A test compound dissolved in DMSO was added by to a reaction solution (50 mM Tris-HCl (pH 8.0), 0.1% BSA, 1 mM DTT) containing LSD1 enzyme, and the m...
US Patent US9714241 (2017)
BindingDB Entry DOI: 10.7270/Q2QZ2CZN
Amine oxidase (flavin-containing) A
(Homo sapiens (Human))
BDBM256649
(US10053456, 28 | US10414761, Example 28 | US109682...)
Show SMILES FC1(F)CCC(CC1)NC(=O)c1cc(cs1)C1CC1NCC1CC1
Show InChI InChI=1S/C18H24F2N2OS/c19-18(20)5-3-13(4-6-18)22-17(23)16-7-12(10-24-16)14-8-15(14)21-9-11-1-2-11/h7,10-11,13-15,21H,1-6,8-9H2,(H,22,23)
US Patent
n/an/a>1.00E+5n/an/an/an/a7.525
Takeda Pharmaceutical Company Limited
US Patent
Assay Description
The MAO-A inhibitory activity evaluation described below followed the protocol of MAO-Glo (registered trademark) Assay of Promega KK.A test compound ...
US Patent US9714241 (2017)
BindingDB Entry DOI: 10.7270/Q2QZ2CZN
Amine oxidase [flavin-containing] B
(Homo sapiens (Human))
BDBM256649
(US10053456, 28 | US10414761, Example 28 | US109682...)
Show SMILES FC1(F)CCC(CC1)NC(=O)c1cc(cs1)C1CC1NCC1CC1
Show InChI InChI=1S/C18H24F2N2OS/c19-18(20)5-3-13(4-6-18)22-17(23)16-7-12(10-24-16)14-8-15(14)21-9-11-1-2-11/h7,10-11,13-15,21H,1-6,8-9H2,(H,22,23)
US Patent
n/an/a>1.00E+5n/an/an/an/a7.525
Takeda Pharmaceutical Company Limited
US Patent
Assay Description
The MAO-B inhibitory activity evaluation described below followed the protocol of MAO-Glo (registered trademark) Assay of Promega KK.A test compound ...
US Patent US9714241 (2017)
BindingDB Entry DOI: 10.7270/Q2QZ2CZN
Lysine-specific histone demethylase 1A
(Homo sapiens (Human))
BDBM256649
(US10053456, 28 | US10414761, Example 28 | US109682...)
Show SMILES FC1(F)CCC(CC1)NC(=O)c1cc(cs1)C1CC1NCC1CC1
Show InChI InChI=1S/C18H24F2N2OS/c19-18(20)5-3-13(4-6-18)22-17(23)16-7-12(10-24-16)14-8-15(14)21-9-11-1-2-11/h7,10-11,13-15,21H,1-6,8-9H2,(H,22,23)
Reactome pathway
US Patent
n/an/a<100n/an/an/an/a8.025
Takeda Pharmaceutical Company Limited
US Patent
Assay Description
A test compound dissolved in DMSO was added by to a reaction solution (50 mM Tris-HCl (pH 8.0), 0.1% BSA, 1 mM DTT) containing LSD1 enzyme, and the m...
US Patent US10053456 (2018)
BindingDB Entry DOI: 10.7270/Q23J3FZ4
Amine oxidase (flavin-containing) A
(Homo sapiens (Human))
BDBM256649
(US10053456, 28 | US10414761, Example 28 | US109682...)
Show SMILES FC1(F)CCC(CC1)NC(=O)c1cc(cs1)C1CC1NCC1CC1
Show InChI InChI=1S/C18H24F2N2OS/c19-18(20)5-3-13(4-6-18)22-17(23)16-7-12(10-24-16)14-8-15(14)21-9-11-1-2-11/h7,10-11,13-15,21H,1-6,8-9H2,(H,22,23)
US Patent
n/an/a>1.00E+5n/an/an/an/a7.525
Takeda Pharmaceutical Company Limited
US Patent
Assay Description
The MAO-A inhibitory activity evaluation described below followed the protocol of MAO-Glo (registered trademark) Assay of Promega KK.A test compound ...
US Patent US10053456 (2018)
BindingDB Entry DOI: 10.7270/Q23J3FZ4
Amine oxidase [flavin-containing] B
(Homo sapiens (Human))
BDBM256649
(US10053456, 28 | US10414761, Example 28 | US109682...)
Show SMILES FC1(F)CCC(CC1)NC(=O)c1cc(cs1)C1CC1NCC1CC1
Show InChI InChI=1S/C18H24F2N2OS/c19-18(20)5-3-13(4-6-18)22-17(23)16-7-12(10-24-16)14-8-15(14)21-9-11-1-2-11/h7,10-11,13-15,21H,1-6,8-9H2,(H,22,23)
US Patent
n/an/a>1.00E+5n/an/an/an/a7.525
Takeda Pharmaceutical Company Limited
US Patent
Assay Description
The MAO-B inhibitory activity evaluation described below followed the protocol of MAO-Glo (registered trademark) Assay of Promega KK.A test compound ...
US Patent US10053456 (2018)
BindingDB Entry DOI: 10.7270/Q23J3FZ4
Lysine-specific histone demethylase 1A
(Homo sapiens (Human))
BDBM256649
(US10053456, 28 | US10414761, Example 28 | US109682...)
Show SMILES FC1(F)CCC(CC1)NC(=O)c1cc(cs1)C1CC1NCC1CC1
Show InChI InChI=1S/C18H24F2N2OS/c19-18(20)5-3-13(4-6-18)22-17(23)16-7-12(10-24-16)14-8-15(14)21-9-11-1-2-11/h7,10-11,13-15,21H,1-6,8-9H2,(H,22,23)
Reactome pathway
US Patent
n/an/a<100n/an/an/an/an/an/a
Montana State University
Assay Description
A test compound dissolved in DMSO was added by to a reaction solution (50 mM Tris-HCl (pH 8.0), 0.1% BSA, 1 mM DTT) containing LSD1 enzyme, and the m...
J Med Chem 50: 4928-38 (2007)
BindingDB Entry DOI: 10.7270/Q2R213PQ
Amine oxidase (flavin-containing) A
(Homo sapiens (Human))
BDBM256649
(US10053456, 28 | US10414761, Example 28 | US109682...)
Show SMILES FC1(F)CCC(CC1)NC(=O)c1cc(cs1)C1CC1NCC1CC1
Show InChI InChI=1S/C18H24F2N2OS/c19-18(20)5-3-13(4-6-18)22-17(23)16-7-12(10-24-16)14-8-15(14)21-9-11-1-2-11/h7,10-11,13-15,21H,1-6,8-9H2,(H,22,23)
US Patent
n/an/a>1.00E+5n/an/an/an/an/an/a
Montana State University
Assay Description
A test compound dissolved in DMSO was added to a reaction solution (100 mM HEPES (pH 7.5), 5% glycerol) containing MAO-A enzyme (Sigma-Aldrich Co. LL...
J Med Chem 50: 4928-38 (2007)
BindingDB Entry DOI: 10.7270/Q2R213PQ
Amine oxidase [flavin-containing] B
(Homo sapiens (Human))
BDBM256649
(US10053456, 28 | US10414761, Example 28 | US109682...)
Show SMILES FC1(F)CCC(CC1)NC(=O)c1cc(cs1)C1CC1NCC1CC1
Show InChI InChI=1S/C18H24F2N2OS/c19-18(20)5-3-13(4-6-18)22-17(23)16-7-12(10-24-16)14-8-15(14)21-9-11-1-2-11/h7,10-11,13-15,21H,1-6,8-9H2,(H,22,23)
US Patent
n/an/a>1.00E+5n/an/an/an/an/an/a
Montana State University
Assay Description
A test compound dissolved in DMSO was added to a reaction solution (100 mM HEPES (pH 7.5), 5% glycerol, 10% DMSO) containing MAO-B enzyme (Sigma-Aldr...
J Med Chem 50: 4928-38 (2007)
BindingDB Entry DOI: 10.7270/Q2R213PQ
Lysine-specific histone demethylase 1A
(Homo sapiens (Human))
BDBM256649
(US10053456, 28 | US10414761, Example 28 | US109682...)
Show SMILES FC1(F)CCC(CC1)NC(=O)c1cc(cs1)C1CC1NCC1CC1
Show InChI InChI=1S/C18H24F2N2OS/c19-18(20)5-3-13(4-6-18)22-17(23)16-7-12(10-24-16)14-8-15(14)21-9-11-1-2-11/h7,10-11,13-15,21H,1-6,8-9H2,(H,22,23)
Reactome pathway
US Patent
n/an/a<100n/an/an/an/an/an/a
Takeda Pharmaceutical Company Limited
US Patent
Assay Description
LSD1: A test compound dissolved in DMSO was added by to a reaction solution (50 mM Tris-HCl (pH 8.0), 0.1% BSA, 1 mM DTT) containing LSD1 enzyme, and...
US Patent US10414761 (2019)
BindingDB Entry DOI: 10.7270/Q2V98BFG
Amine oxidase (flavin-containing) A
(Homo sapiens (Human))
BDBM256649
(US10053456, 28 | US10414761, Example 28 | US109682...)
Show SMILES FC1(F)CCC(CC1)NC(=O)c1cc(cs1)C1CC1NCC1CC1
Show InChI InChI=1S/C18H24F2N2OS/c19-18(20)5-3-13(4-6-18)22-17(23)16-7-12(10-24-16)14-8-15(14)21-9-11-1-2-11/h7,10-11,13-15,21H,1-6,8-9H2,(H,22,23)
US Patent
n/an/a>1.00E+5n/an/an/an/an/an/a
Takeda Pharmaceutical Company Limited
US Patent
Assay Description
MAO-A: The MAO-A inhibitory activity evaluation described below followed the protocol of MAO-Glo (registered trademark) Assay of Promega KK.A test co...
US Patent US10414761 (2019)
BindingDB Entry DOI: 10.7270/Q2V98BFG
Amine oxidase [flavin-containing] B
(Homo sapiens (Human))
BDBM256649
(US10053456, 28 | US10414761, Example 28 | US109682...)
Show SMILES FC1(F)CCC(CC1)NC(=O)c1cc(cs1)C1CC1NCC1CC1
Show InChI InChI=1S/C18H24F2N2OS/c19-18(20)5-3-13(4-6-18)22-17(23)16-7-12(10-24-16)14-8-15(14)21-9-11-1-2-11/h7,10-11,13-15,21H,1-6,8-9H2,(H,22,23)
US Patent
n/an/a>1.00E+5n/an/an/an/an/an/a
Takeda Pharmaceutical Company Limited
US Patent
Assay Description
MAO-B: The MAO-B inhibitory activity evaluation described below followed the protocol of MAO-Glo (registered trademark) Assay of Promega KK.A test co...
US Patent US10414761 (2019)
BindingDB Entry DOI: 10.7270/Q2V98BFG
Lysine-specific histone demethylase 1A
(Homo sapiens (Human))
BDBM256649
(US10053456, 28 | US10414761, Example 28 | US109682...)
Show SMILES FC1(F)CCC(CC1)NC(=O)c1cc(cs1)C1CC1NCC1CC1
Show InChI InChI=1S/C18H24F2N2OS/c19-18(20)5-3-13(4-6-18)22-17(23)16-7-12(10-24-16)14-8-15(14)21-9-11-1-2-11/h7,10-11,13-15,21H,1-6,8-9H2,(H,22,23)
Reactome pathway
US Patent
n/an/a<100n/an/an/an/an/an/a
Takeda Pharmaceutical Company Limited
US Patent
Assay Description
LSD1: A test compound dissolved in DMSO was added by to a reaction solution (50 mM Tris-HCl (pH 8.0), 0.1% BSA, 1 mM DTT) containing LSD1 enzyme, and...
US Patent US10968213 (2021)
Amine oxidase (flavin-containing) A
(Homo sapiens (Human))
BDBM256649
(US10053456, 28 | US10414761, Example 28 | US109682...)
Show SMILES FC1(F)CCC(CC1)NC(=O)c1cc(cs1)C1CC1NCC1CC1
Show InChI InChI=1S/C18H24F2N2OS/c19-18(20)5-3-13(4-6-18)22-17(23)16-7-12(10-24-16)14-8-15(14)21-9-11-1-2-11/h7,10-11,13-15,21H,1-6,8-9H2,(H,22,23)
US Patent
n/an/a>1.00E+5n/an/an/an/an/an/a
Takeda Pharmaceutical Company Limited
US Patent
Assay Description
The MAO-A inhibitory activity evaluation described below followed the protocol of MAO-Glo (registered trademark) Assay of Promega KK.A test compound ...
US Patent US10968213 (2021)
Amine oxidase (flavin-containing) A
(Homo sapiens (Human))
BDBM256649
(US10053456, 28 | US10414761, Example 28 | US109682...)
Show SMILES FC1(F)CCC(CC1)NC(=O)c1cc(cs1)C1CC1NCC1CC1
Show InChI InChI=1S/C18H24F2N2OS/c19-18(20)5-3-13(4-6-18)22-17(23)16-7-12(10-24-16)14-8-15(14)21-9-11-1-2-11/h7,10-11,13-15,21H,1-6,8-9H2,(H,22,23)
US Patent
n/an/a>1.00E+5n/an/an/an/a7.525
Takeda Pharmaceutical Company Limited
US Patent
Assay Description
The MAO-A inhibitory activity evaluation described below followed the protocol of MAO-Glo (registered trademark) Assay of Promega KK.A test compound ...
US Patent US9487511 (2016)
BindingDB Entry DOI: 10.7270/Q2V123Q4