null
SMILES: O=C(NC1CCCC1)c1csc(c1)[C@@H]1C[C@@H]1NC1CCOCC1
InChI Key: InChIKey=MOVLXQVSHSESHI-CVEARBPZSA-N
Activity Spreadsheet -- Enzyme Inhibition Constant Data from BindingDB
Found 3 hits for monomerid = 256660
Trg + Lig
Ki
nM
ΔG°
kcal/mole
IC50
nM
Kd
nM
EC50/IC50
nM
koff
s-1
kon
M-1s-1
pHTemp
°C
Glutathione S-transferase P/Lysine-specific histone demethylase 1A [172-833]
(Homo sapiens (Human))
BDBM256660
(US9487511, 39)
Show SMILES O=C(NC1CCCC1)c1csc(c1)[C@@H]1C[C@@H]1NC1CCOCC1 |r|
Show InChI InChI=1S/C18H26N2O2S/c21-18(20-13-3-1-2-4-13)12-9-17(23-11-12)15-10-16(15)19-14-5-7-22-8-6-14/h9,11,13-16,19H,1-8,10H2,(H,20,21)/t15-,16+/m1/s1
US Patent
n/an/a<100n/an/an/an/a8.025
Takeda Pharmaceutical Company Limited
US Patent
Assay Description
A test compound dissolved in DMSO was added by to a reaction solution (50 mM Tris-HCl (pH 8.0), 0.1% BSA, 1 mM DTT) containing LSD1 enzyme, and the m...
US Patent US9487511 (2016)
BindingDB Entry DOI: 10.7270/Q2V123Q4
Amine oxidase [flavin-containing] B
(Homo sapiens (Human))
BDBM256660
(US9487511, 39)
Show SMILES O=C(NC1CCCC1)c1csc(c1)[C@@H]1C[C@@H]1NC1CCOCC1 |r|
Show InChI InChI=1S/C18H26N2O2S/c21-18(20-13-3-1-2-4-13)12-9-17(23-11-12)15-10-16(15)19-14-5-7-22-8-6-14/h9,11,13-16,19H,1-8,10H2,(H,20,21)/t15-,16+/m1/s1
US Patent
n/an/a>1.00E+5n/an/an/an/a7.525
Takeda Pharmaceutical Company Limited
US Patent
Assay Description
The MAO-B inhibitory activity evaluation described below followed the protocol of MAO-Glo (registered trademark) Assay of Promega KK. A test compound...
US Patent US9487511 (2016)
BindingDB Entry DOI: 10.7270/Q2V123Q4
Amine oxidase [flavin-containing] A
(Homo sapiens (Human))
BDBM256660
(US9487511, 39)
Show SMILES O=C(NC1CCCC1)c1csc(c1)[C@@H]1C[C@@H]1NC1CCOCC1 |r|
Show InChI InChI=1S/C18H26N2O2S/c21-18(20-13-3-1-2-4-13)12-9-17(23-11-12)15-10-16(15)19-14-5-7-22-8-6-14/h9,11,13-16,19H,1-8,10H2,(H,20,21)/t15-,16+/m1/s1
US Patent
n/an/a 2.30E+4n/an/an/an/a7.525
Takeda Pharmaceutical Company Limited
US Patent
Assay Description
The MAO-A inhibitory activity evaluation described below followed the protocol of MAO-Glo (registered trademark) Assay of Promega KK.A test compound ...
US Patent US9487511 (2016)
BindingDB Entry DOI: 10.7270/Q2V123Q4