BDBM256663 US9487511, 42
SMILES: O=C(NC1CCOCC1)c1csc(c1)[C@H]1C[C@H]1NC1CCC1
InChI Key: InChIKey=CGTUABNRJYZTFD-LSDHHAIUSA-N
Data: 3 IC50
Activity Spreadsheet -- Enzyme Inhibition Constant Data from BindingDB
Found 3 hits for monomerid = 256663
Trg + Lig
Ki
nM
ΔG°
kcal/mole
IC50
nM
Kd
nM
EC50/IC50
nM
koff
s-1
kon
M-1s-1
pHTemp
°C
GST-Lysine-specific histone demethylase 1A (LSD1)
(Homo sapiens (Human))
BDBM256663
(US9487511, 42)
Show SMILES O=C(NC1CCOCC1)c1csc(c1)[C@H]1C[C@H]1NC1CCC1 |r|
Show InChI InChI=1S/C17H24N2O2S/c20-17(19-13-4-6-21-7-5-13)11-8-16(22-10-11)14-9-15(14)18-12-2-1-3-12/h8,10,12-15,18H,1-7,9H2,(H,19,20)/t14-,15+/m0/s1
US Patent
n/an/a<100n/an/an/an/a8.025
Takeda Pharmaceutical Company Limited
US Patent
Assay Description
A test compound dissolved in DMSO was added by to a reaction solution (50 mM Tris-HCl (pH 8.0), 0.1% BSA, 1 mM DTT) containing LSD1 enzyme, and the m...
US Patent US9487511 (2016)
BindingDB Entry DOI: 10.7270/Q2V123Q4
Amine oxidase [flavin-containing] B
(Homo sapiens (Human))
BDBM256663
(US9487511, 42)
Show SMILES O=C(NC1CCOCC1)c1csc(c1)[C@H]1C[C@H]1NC1CCC1 |r|
Show InChI InChI=1S/C17H24N2O2S/c20-17(19-13-4-6-21-7-5-13)11-8-16(22-10-11)14-9-15(14)18-12-2-1-3-12/h8,10,12-15,18H,1-7,9H2,(H,19,20)/t14-,15+/m0/s1
US Patent
n/an/a>1.00E+5n/an/an/an/a7.525
Takeda Pharmaceutical Company Limited
US Patent
Assay Description
The MAO-B inhibitory activity evaluation described below followed the protocol of MAO-Glo (registered trademark) Assay of Promega KK. A test compound...
US Patent US9487511 (2016)
BindingDB Entry DOI: 10.7270/Q2V123Q4
Amine oxidase (flavin-containing) A
(Homo sapiens (Human))
BDBM256663
(US9487511, 42)
Show SMILES O=C(NC1CCOCC1)c1csc(c1)[C@H]1C[C@H]1NC1CCC1 |r|
Show InChI InChI=1S/C17H24N2O2S/c20-17(19-13-4-6-21-7-5-13)11-8-16(22-10-11)14-9-15(14)18-12-2-1-3-12/h8,10,12-15,18H,1-7,9H2,(H,19,20)/t14-,15+/m0/s1
US Patent
n/an/a>1.00E+5n/an/an/an/a7.525
Takeda Pharmaceutical Company Limited
US Patent
Assay Description
The MAO-A inhibitory activity evaluation described below followed the protocol of MAO-Glo (registered trademark) Assay of Promega KK.A test compound ...
US Patent US9487511 (2016)
BindingDB Entry DOI: 10.7270/Q2V123Q4