BDBM25674 1-{4-[(5-bromo-1,3-thiazol-2-yl)amino]phenyl}ethan-1-one::aminothiazole analogue, 18
SMILES: CC(=O)c1ccc(Nc2ncc(Br)s2)cc1
InChI Key: InChIKey=IGLFYBIFTRNUCG-UHFFFAOYSA-N
Data: 1 IC50
Activity Spreadsheet -- Enzyme Inhibition Constant Data from BindingDB
Found 1 hit for monomerid = 25674
Trg + Lig
Ki
nM
ΔG°
kcal/mole
IC50
nM
Kd
nM
EC50/IC50
nM
koff
s-1
kon
M-1s-1
pHTemp
°C
Aurora kinase A
(Homo sapiens (Human))
BDBM25674
(1-{4-[(5-bromo-1,3-thiazol-2-yl)amino]phenyl}ethan...)
Show SMILES CC(=O)c1ccc(Nc2ncc(Br)s2)cc1
Show InChI InChI=1S/C11H9BrN2OS/c1-7(15)8-2-4-9(5-3-8)14-11-13-6-10(12)16-11/h2-6H,1H3,(H,13,14)
NCI pathway
Reactome pathway
n/an/a 1.70E+3n/an/an/an/a7.022
Novartis
Assay Description
The biochemical activity of compounds was determined by incubation with Aurora A and substrates in the presence ATP/[gamma-33P] ATP. After incubatio...
ACS Chem Biol 3: 180-92 (2008)
Article DOI: 10.1021/cb700200w
BindingDB Entry DOI: 10.7270/Q2HX1B03