BDBM25676 1-N-(5-bromo-1,3-thiazol-2-yl)benzene-1,4-diamine::aminothiazole analogue, 20
SMILES: Nc1ccc(Nc2ncc(Br)s2)cc1
InChI Key: InChIKey=RDLRRWXLEXYXMJ-UHFFFAOYSA-N
Data: 1 IC50
Activity Spreadsheet -- Enzyme Inhibition Constant Data from BindingDB
Found 1 hit for monomerid = 25676
Trg + Lig
Ki
nM
ΔG°
kcal/mole
IC50
nM
Kd
nM
EC50/IC50
nM
koff
s-1
kon
M-1s-1
pHTemp
°C
Aurora kinase A
(Homo sapiens (Human))
BDBM25676
(1-N-(5-bromo-1,3-thiazol-2-yl)benzene-1,4-diamine ...)
Show SMILES Nc1ccc(Nc2ncc(Br)s2)cc1
Show InChI InChI=1S/C9H8BrN3S/c10-8-5-12-9(14-8)13-7-3-1-6(11)2-4-7/h1-5H,11H2,(H,12,13)
NCI pathway
Reactome pathway
n/an/a 600n/an/an/an/a7.022
Novartis
Assay Description
The biochemical activity of compounds was determined by incubation with Aurora A and substrates in the presence ATP/[gamma-33P] ATP. After incubatio...
ACS Chem Biol 3: 180-92 (2008)
Article DOI: 10.1021/cb700200w
BindingDB Entry DOI: 10.7270/Q2HX1B03