BDBM25680 4-[(5-bromo-1,3-thiazol-2-yl)amino]benzoic acid::aminothiazole analogue, 24
SMILES: OC(=O)c1ccc(Nc2ncc(Br)s2)cc1
InChI Key: InChIKey=MEBBDDHYRXPAPC-UHFFFAOYSA-N
Data: 3 IC50
Activity Spreadsheet -- Enzyme Inhibition Constant Data from BindingDB
Found 3 hits for monomerid = 25680
Trg + Lig
Ki
nM
ΔG°
kcal/mole
IC50
nM
Kd
nM
EC50/IC50
nM
koff
s-1
kon
M-1s-1
pHTemp
°C
Aurora kinase A
(Homo sapiens (Human))
BDBM25680
(4-[(5-bromo-1,3-thiazol-2-yl)amino]benzoic acid | ...)
Show SMILES OC(=O)c1ccc(Nc2ncc(Br)s2)cc1
Show InChI InChI=1S/C10H7BrN2O2S/c11-8-5-12-10(16-8)13-7-3-1-6(2-4-7)9(14)15/h1-5H,(H,12,13)(H,14,15)
NCI pathway
Reactome pathway
n/an/a 79n/an/an/an/a7.022
Novartis
Assay Description
The biochemical activity of compounds was determined by incubation with Aurora A and substrates in the presence ATP/[gamma-33P] ATP. After incubatio...
ACS Chem Biol 3: 180-92 (2008)
Article DOI: 10.1021/cb700200w
BindingDB Entry DOI: 10.7270/Q2HX1B03
Cyclin-Dependent Kinase 1 (CDK1)
(Homo sapiens (Human))
BDBM25680
(4-[(5-bromo-1,3-thiazol-2-yl)amino]benzoic acid | ...)
Show SMILES OC(=O)c1ccc(Nc2ncc(Br)s2)cc1
Show InChI InChI=1S/C10H7BrN2O2S/c11-8-5-12-10(16-8)13-7-3-1-6(2-4-7)9(14)15/h1-5H,(H,12,13)(H,14,15)
Reactome pathway
n/an/a>1.00E+4n/an/an/an/an/an/a
Novartis
Assay Description
Enzyme activity was assayed using Z-LYTE Enzymatic Kinase Assay format (Invitrogen Corp., Carlsbad, CA) in the SelectScreen Kinase Profiling Service...
ACS Chem Biol 3: 180-92 (2008)
Article DOI: 10.1021/cb700200w
BindingDB Entry DOI: 10.7270/Q2HX1B03
Cytochrome P450 19A1
(Homo sapiens (Human))
BDBM25680
(4-[(5-bromo-1,3-thiazol-2-yl)amino]benzoic acid | ...)
Show SMILES OC(=O)c1ccc(Nc2ncc(Br)s2)cc1
Show InChI InChI=1S/C10H7BrN2O2S/c11-8-5-12-10(16-8)13-7-3-1-6(2-4-7)9(14)15/h1-5H,(H,12,13)(H,14,15)
Reactome pathway
n/an/a 960n/an/an/an/an/an/a
Novartis
Assay Description
Enzyme activity was assayed using Z-LYTE Enzymatic Kinase Assay format (Invitrogen Corp., Carlsbad, CA) in the SelectScreen Kinase Profiling Service...
ACS Chem Biol 3: 180-92 (2008)
Article DOI: 10.1021/cb700200w
BindingDB Entry DOI: 10.7270/Q2HX1B03