BDBM256861 US10654855, Example 49A::US9492453, 49A
SMILES: NC1(CCN(CC1)c1ncnc2[nH]ccc12)C(=O)N[C@H](CCCN1CCCCC1)c1ccc(Cl)cc1
InChI Key:
Data: 2 IC50
Activity Spreadsheet -- Enzyme Inhibition Constant Data from BindingDB
Found 2 hits for monomerid = 256861
Trg + Lig
Ki
nM
ΔG°
kcal/mole
IC50
nM
Kd
nM
EC50/IC50
nM
koff
s-1
kon
M-1s-1
pHTemp
°C
RAC-alpha serine/threonine-protein kinase
(Homo sapiens (Human))
BDBM256861
(US10654855, Example 49A | US9492453, 49A)
Show SMILES NC1(CCN(CC1)c1ncnc2[nH]ccc12)C(=O)N[C@H](CCCN1CCCCC1)c1ccc(Cl)cc1 |r|
US Patent
n/an/a 3.30n/an/an/an/an/an/a
AstraZeneca AB
US Patent
Assay Description
For Echo dosing the solvent was 100% DMSO. A master plate was prepared with 40 ul of 10 mM stock from our Primary Liquid Store in quadrant 1 of a Lab...
US Patent US10654855 (2020)
RAC-alpha serine/threonine-protein kinase
(Homo sapiens (Human))
BDBM256861
(US10654855, Example 49A | US9492453, 49A)
Show SMILES NC1(CCN(CC1)c1ncnc2[nH]ccc12)C(=O)N[C@H](CCCN1CCCCC1)c1ccc(Cl)cc1 |r|
US Patent
n/an/a 3.30n/an/an/an/a7.525
AstraZeneca AB
US Patent
Assay Description
This assay detects inhibitors of AKT1 (PKBα) kinase activity using Caliper LabChip LC3000. The Caliper off-chip incubation mobility shift assay...
US Patent US9492453 (2016)
BindingDB Entry DOI: 10.7270/Q2KH0M83