BDBM25689 4-[(5-bromo-1,3-thiazol-2-yl)amino]-N-[2-(pyrrolidin-1-yl)ethyl]benzamide::aminothiazole analogue, 33
SMILES: Brc1cnc(Nc2ccc(cc2)C(=O)NCCN2CCCC2)s1
InChI Key: InChIKey=DMIBSRUIECZFKG-UHFFFAOYSA-N
Data: 1 IC50
Activity Spreadsheet -- Enzyme Inhibition Constant Data from BindingDB
Found 1 hit for monomerid = 25689
Trg + Lig
Ki
nM
ΔG°
kcal/mole
IC50
nM
Kd
nM
EC50/IC50
nM
koff
s-1
kon
M-1s-1
pHTemp
°C
Aurora kinase A
(Homo sapiens (Human))
BDBM25689
(4-[(5-bromo-1,3-thiazol-2-yl)amino]-N-[2-(pyrrolid...)
Show SMILES Brc1cnc(Nc2ccc(cc2)C(=O)NCCN2CCCC2)s1
Show InChI InChI=1S/C16H19BrN4OS/c17-14-11-19-16(23-14)20-13-5-3-12(4-6-13)15(22)18-7-10-21-8-1-2-9-21/h3-6,11H,1-2,7-10H2,(H,18,22)(H,19,20)
NCI pathway
Reactome pathway
n/an/a 5.32E+3n/an/an/an/an/an/a
Novartis
Assay Description
The biochemical activity of compounds was determined by incubation with Aurora A and substrates in the presence ATP/[gamma-33P] ATP. After incubatio...
ACS Chem Biol 3: 180-92 (2008)
Article DOI: 10.1021/cb700200w
BindingDB Entry DOI: 10.7270/Q2HX1B03