BDBM25690 5-bromo-N-(3-fluorophenyl)-1,3-thiazol-2-amine::aminothiazole analogue, 34
SMILES: Fc1cccc(Nc2ncc(Br)s2)c1
InChI Key: InChIKey=MRAZFLXMJRTUFH-UHFFFAOYSA-N
Data: 1 IC50
Activity Spreadsheet -- Enzyme Inhibition Constant Data from BindingDB
Found 1 hit for monomerid = 25690
Trg + Lig
Ki
nM
ΔG°
kcal/mole
IC50
nM
Kd
nM
EC50/IC50
nM
koff
s-1
kon
M-1s-1
pHTemp
°C
Aurora kinase A
(Homo sapiens (Human))
BDBM25690
(5-bromo-N-(3-fluorophenyl)-1,3-thiazol-2-amine | a...)
Show SMILES Fc1cccc(Nc2ncc(Br)s2)c1
Show InChI InChI=1S/C9H6BrFN2S/c10-8-5-12-9(14-8)13-7-3-1-2-6(11)4-7/h1-5H,(H,12,13)
NCI pathway
Reactome pathway
n/an/a 9.30E+3n/an/an/an/an/an/a
Novartis
Assay Description
The biochemical activity of compounds was determined by incubation with Aurora A and substrates in the presence ATP/[gamma-33P] ATP. After incubatio...
ACS Chem Biol 3: 180-92 (2008)
Article DOI: 10.1021/cb700200w
BindingDB Entry DOI: 10.7270/Q2HX1B03