BDBM25699 3-[(5-bromo-1,3-thiazol-2-yl)amino]-N-methylbenzamide::aminothiazole analogue, 43
SMILES: CNC(=O)c1cccc(Nc2ncc(Br)s2)c1
InChI Key: InChIKey=RREAPIQCBWUWAP-UHFFFAOYSA-N
Data: 1 IC50
Activity Spreadsheet -- Enzyme Inhibition Constant Data from BindingDB
Found 1 hit for monomerid = 25699
Trg + Lig
Ki
nM
ΔG°
kcal/mole
IC50
nM
Kd
nM
EC50/IC50
nM
koff
s-1
kon
M-1s-1
pHTemp
°C
Aurora kinase A
(Homo sapiens (Human))
BDBM25699
(3-[(5-bromo-1,3-thiazol-2-yl)amino]-N-methylbenzam...)
Show SMILES CNC(=O)c1cccc(Nc2ncc(Br)s2)c1
Show InChI InChI=1S/C11H10BrN3OS/c1-13-10(16)7-3-2-4-8(5-7)15-11-14-6-9(12)17-11/h2-6H,1H3,(H,13,16)(H,14,15)
NCI pathway
Reactome pathway
n/an/a 740n/an/an/an/an/an/a
Novartis
Assay Description
The biochemical activity of compounds was determined by incubation with Aurora A and substrates in the presence ATP/[gamma-33P] ATP. After incubatio...
ACS Chem Biol 3: 180-92 (2008)
Article DOI: 10.1021/cb700200w
BindingDB Entry DOI: 10.7270/Q2HX1B03