BDBM25714 5-bromo-N-(2-phenylethyl)-1,3-thiazol-2-amine::aminothiazole analogue, 58
SMILES: Brc1cnc(NCCc2ccccc2)s1
InChI Key: InChIKey=GDGHWVAVROMLFA-UHFFFAOYSA-N
Data: 1 IC50
Activity Spreadsheet -- Enzyme Inhibition Constant Data from BindingDB
Found 1 hit for monomerid = 25714
Trg + Lig
Ki
nM
ΔG°
kcal/mole
IC50
nM
Kd
nM
EC50/IC50
nM
koff
s-1
kon
M-1s-1
pHTemp
°C
Aurora kinase A
(Homo sapiens (Human))
BDBM25714
(5-bromo-N-(2-phenylethyl)-1,3-thiazol-2-amine | am...)
Show SMILES Brc1cnc(NCCc2ccccc2)s1
Show InChI InChI=1S/C11H11BrN2S/c12-10-8-14-11(15-10)13-7-6-9-4-2-1-3-5-9/h1-5,8H,6-7H2,(H,13,14)
NCI pathway
Reactome pathway
n/an/a>1.00E+4n/an/an/an/an/an/a
Novartis
Assay Description
The biochemical activity of compounds was determined by incubation with Aurora A and substrates in the presence ATP/[gamma-33P] ATP. After incubatio...
ACS Chem Biol 3: 180-92 (2008)
Article DOI: 10.1021/cb700200w
BindingDB Entry DOI: 10.7270/Q2HX1B03