BDBM25717 5-bromo-N-(pyridin-3-yl)-1,3-thiazol-2-amine::aminothiazole analogue, 61
SMILES: Brc1cnc(Nc2cccnc2)s1
InChI Key: InChIKey=YCEGXEAMIJRCDM-UHFFFAOYSA-N
Data: 1 IC50
Activity Spreadsheet -- Enzyme Inhibition Constant Data from BindingDB
Found 1 hit for monomerid = 25717
Trg + Lig
Ki
nM
ΔG°
kcal/mole
IC50
nM
Kd
nM
EC50/IC50
nM
koff
s-1
kon
M-1s-1
pHTemp
°C
Aurora kinase A
(Homo sapiens (Human))
BDBM25717
(5-bromo-N-(pyridin-3-yl)-1,3-thiazol-2-amine | ami...)
Show SMILES Brc1cnc(Nc2cccnc2)s1
Show InChI InChI=1S/C8H6BrN3S/c9-7-5-11-8(13-7)12-6-2-1-3-10-4-6/h1-5H,(H,11,12)
NCI pathway
Reactome pathway
n/an/a 3.60E+3n/an/an/an/an/an/a
Novartis
Assay Description
The biochemical activity of compounds was determined by incubation with Aurora A and substrates in the presence ATP/[gamma-33P] ATP. After incubatio...
ACS Chem Biol 3: 180-92 (2008)
Article DOI: 10.1021/cb700200w
BindingDB Entry DOI: 10.7270/Q2HX1B03