BDBM257311 US9493440, 155
SMILES: CC1(CC1)Oc1cc2c(n[nH]c2cc1F)-c1cc(ncn1)N1CCN(CC1)S(C)(=O)=O
InChI Key: InChIKey=BZPJYOSSAZLHFA-UHFFFAOYSA-N
Data: 1 IC50
Activity Spreadsheet -- Enzyme Inhibition Constant Data from BindingDB
Found 1 hit for monomerid = 257311
Trg + Lig
Ki
nM
ΔG°
kcal/mole
IC50
nM
Kd
nM
EC50/IC50
nM
koff
s-1
kon
M-1s-1
pHTemp
°C
Leucine-rich repeat serine/threonine-protein kinase 2 (LRRK2)(G2019S)
(Homo sapiens (Human))
BDBM257311
(US9493440, 155)
Show SMILES CC1(CC1)Oc1cc2c(n[nH]c2cc1F)-c1cc(ncn1)N1CCN(CC1)S(C)(=O)=O
Show InChI InChI=1S/C20H23FN6O3S/c1-20(3-4-20)30-17-9-13-15(10-14(17)21)24-25-19(13)16-11-18(23-12-22-16)26-5-7-27(8-6-26)31(2,28)29/h9-12H,3-8H2,1-2H3,(H,24,25)
US Patent
n/an/a<0.600n/an/an/an/a8.525
Merck Sharp & Dohme Corp.
US Patent
Assay Description
a) 400 nl of a 1:2.15 serial dilution of test compound (98 uM top assay concentration) is spotted via Labcyte Echo to certain wells in a 384 well bla...
US Patent US9493440 (2016)
BindingDB Entry DOI: 10.7270/Q2668C4X