BDBM25767 Timolol::racemic-Timolol::tert-butyl(2-hydroxy-3-{[4-(morpholin-4-yl)-1,2,5-thiadiazol-3-yl]oxy}propyl)amine
SMILES: CC(C)(C)NCC(O)COc1nsnc1N1CCOCC1
InChI Key: InChIKey=BLJRIMJGRPQVNF-UHFFFAOYSA-N
Data: 1 IC50  3 Kd
PDB links: 3 PDB IDs match this monomer.
Activity Spreadsheet -- Enzyme Inhibition Constant Data from BindingDB
Found 4 hits for monomerid = 25767
Trg + Lig
Ki
nM
ΔG°
kcal/mole
IC50
nM
Kd
nM
EC50/IC50
nM
koff
s-1
kon
M-1s-1
pHTemp
°C
Beta-1 adrenergic receptor
(Homo sapiens (Human))
BDBM25767
(Timolol | racemic-Timolol | tert-butyl(2-hydroxy-3...)
Show SMILES CC(C)(C)NCC(O)COc1nsnc1N1CCOCC1
Show InChI InChI=1S/C13H24N4O3S/c1-13(2,3)14-8-10(18)9-20-12-11(15-21-16-12)17-4-6-19-7-5-17/h10,14,18H,4-9H2,1-3H3
Reactome pathway
n/an/an/a 5.35n/an/an/a7.437
University of Nottingham
Assay Description
The whole cell-binding studies were undertaken in CHO cell lines stably expressing each beta-adrenoceptor subtype. Nonspecific binding was determined...
Br J Pharmacol 144: 317-22 (2005)
Article DOI: 10.1038/sj.bjp.0706048
BindingDB Entry DOI: 10.7270/Q28C9TKV
Bile salt export pump
(Homo sapiens (Human))
BDBM25767
(Timolol | racemic-Timolol | tert-butyl(2-hydroxy-3...)
Show SMILES CC(C)(C)NCC(O)COc1nsnc1N1CCOCC1
Show InChI InChI=1S/C13H24N4O3S/c1-13(2,3)14-8-10(18)9-20-12-11(15-21-16-12)17-4-6-19-7-5-17/h10,14,18H,4-9H2,1-3H3
n/an/a>1.00E+6n/an/an/an/an/an/a
AstraZeneca
Curated by ChEMBL
Assay Description
Inhibition of human BSEP expressed in baculovirus transfected fall armyworm Sf21 cell membranes vesicles assessed as reduction in ATP-dependent [3H]-...
Drug Metab Dispos 40: 2332-41 (2012)
Article DOI: 10.1124/dmd.112.047068
BindingDB Entry DOI: 10.7270/Q2ZP488M
Beta-3 adrenergic receptor
(Homo sapiens (Human))
BDBM25767
(Timolol | racemic-Timolol | tert-butyl(2-hydroxy-3...)
Show SMILES CC(C)(C)NCC(O)COc1nsnc1N1CCOCC1
Show InChI InChI=1S/C13H24N4O3S/c1-13(2,3)14-8-10(18)9-20-12-11(15-21-16-12)17-4-6-19-7-5-17/h10,14,18H,4-9H2,1-3H3
Reactome pathway
n/an/an/a 158n/an/an/an/an/a
University of Nottingham
Assay Description
The whole cell-binding studies were undertaken in CHO cell lines stably expressing each beta-adrenoceptor subtype. Nonspecific binding was determined...
Br J Pharmacol 144: 317-22 (2005)
Article DOI: 10.1038/sj.bjp.0706048
BindingDB Entry DOI: 10.7270/Q28C9TKV
Beta-2 adrenergic receptor
(Homo sapiens (Human))
BDBM25767
(Timolol | racemic-Timolol | tert-butyl(2-hydroxy-3...)
Show SMILES CC(C)(C)NCC(O)COc1nsnc1N1CCOCC1
Show InChI InChI=1S/C13H24N4O3S/c1-13(2,3)14-8-10(18)9-20-12-11(15-21-16-12)17-4-6-19-7-5-17/h10,14,18H,4-9H2,1-3H3
Reactome pathway
n/an/an/a 0.210n/an/an/an/an/a
University of Nottingham
Assay Description
The whole cell-binding studies were undertaken in CHO cell lines stably expressing each beta-adrenoceptor subtype. Nonspecific binding was determined...
Br J Pharmacol 144: 317-22 (2005)
Article DOI: 10.1038/sj.bjp.0706048
BindingDB Entry DOI: 10.7270/Q28C9TKV