BDBM25806 (13R,14R,15S)-15-methyltetracyclo[8.7.0.0^{2,7}.0^{11,15}]heptadeca-2,4,6-triene-5,13,14-triol::Epiestriol::Estriol
SMILES: C[C@]12CCC3C(CCc4cc(O)ccc34)C1C[C@@H](O)[C@@H]2O
InChI Key: InChIKey=PROQIPRRNZUXQM-YDGSGPMOSA-N
Data: 1 Kd
PDB links: 1 PDB ID matches this monomer. 2 PDB IDs contain this monomer as substructures. 2 PDB IDs contain inhibitors having a similarity of 90% to this monomer.
Activity Spreadsheet -- Enzyme Inhibition Constant Data from BindingDB
Found 1 hit for monomerid = 25806
Trg + Lig
Ki
nM
ΔG°
kcal/mole
IC50
nM
Kd
nM
EC50/IC50
nM
koff
s-1
kon
M-1s-1
pHTemp
°C
Lanosterol 14-alpha demethylase
(Mycobacterium tuberculosis (strain CDC 1551 / Oshk...)
BDBM25806
((13R,14R,15S)-15-methyltetracyclo[8.7.0.0^{2,7}.0^...)
Show SMILES C[C@]12CCC3C(CCc4cc(O)ccc34)C1C[C@@H](O)[C@@H]2O |r|
Show InChI InChI=1S/C18H24O3/c1-18-7-6-13-12-5-3-11(19)8-10(12)2-4-14(13)15(18)9-16(20)17(18)21/h3,5,8,13-17,19-21H,2,4,6-7,9H2,1H3/t13?,14?,15?,16-,17+,18+/m1/s1
n/an/an/a 1.00E+5n/an/an/a7.537
University of California at San Francisco
Assay Description
The assay was developed based on the optical spectral property of P450 enzyme to elicit both type I and type II spectral changes (350 nm through 450 ...
Antimicrob Agents Chemother 51: 3915-23 (2007)
Article DOI: 10.1128/AAC.00311-07
BindingDB Entry DOI: 10.7270/Q20V8B3R
3D
3D Structure (crystal)