null
SMILES: Oc1ccc2-c3ccc(O)cc3C(=O)c2c1
InChI Key: InChIKey=CWHPQXRTQSNTRR-UHFFFAOYSA-N
Activity Spreadsheet -- Enzyme Inhibition Constant Data from BindingDB
Found 1 hit for monomerid = 25808
Trg + Lig
Ki
nM
ΔG°
kcal/mole
IC50
nM
Kd
nM
EC50/IC50
nM
koff
s-1
kon
M-1s-1
pHTemp
°C
Lanosterol 14-alpha demethylase
(Mycobacterium tuberculosis (strain CDC 1551 / Oshk...)
BDBM25808
(2,7-Dihydroxy-9-fluorenone | 2,7-dihydroxy-9H-fluo...)
Show SMILES Oc1ccc2-c3ccc(O)cc3C(=O)c2c1
Show InChI InChI=1S/C13H8O3/c14-7-1-3-9-10-4-2-8(15)6-12(10)13(16)11(9)5-7/h1-6,14-15H
n/an/an/a 3.75E+4n/an/an/a7.537
University of California at San Francisco
Assay Description
The assay was developed based on the optical spectral property of P450 enzyme to elicit both type I and type II spectral changes (350 nm through 450 ...
Antimicrob Agents Chemother 51: 3915-23 (2007)
Article DOI: 10.1128/AAC.00311-07
BindingDB Entry DOI: 10.7270/Q20V8B3R