null
SMILES: Cn1nccc1[C@H]1CCCCC[C@@H]1Oc1cc(F)c(cc1F)S(=O)(=O)Nc1ncns1
InChI Key: InChIKey=HHKWZMIRLHNBPY-WBMJQRKESA-N
Activity Spreadsheet -- Enzyme Inhibition Constant Data from BindingDB
Found 2 hits for monomerid = 258107
Trg + Lig
Ki
nM
ΔG°
kcal/mole
IC50
nM
Kd
nM
EC50/IC50
nM
koff
s-1
kon
M-1s-1
pHTemp
°C
Sodium channel protein type 9 subunit alpha
(Homo sapiens (Human))
BDBM258107
(US9493448, 9 | US9845313, Example 9)
Show SMILES Cn1nccc1[C@H]1CCCCC[C@@H]1Oc1cc(F)c(cc1F)S(=O)(=O)Nc1ncns1 |r|
Show InChI InChI=1S/C19H21F2N5O3S2/c1-26-15(7-8-23-26)12-5-3-2-4-6-16(12)29-17-9-14(21)18(10-13(17)20)31(27,28)25-19-22-11-24-30-19/h7-12,16H,2-6H2,1H3,(H,22,24,25)/t12-,16+/m1/s1
US Patent
n/an/a 14n/an/an/an/an/an/a
DAIICHI SANKYO COMPANY, LIMITED
US Patent
Assay Description
Current record was obtained by an automated patch clamp system “IonWorks Quattro (Molecular Devices Corporation)” in Population Patch Clamp mode. The...
US Patent US9845313 (2017)
BindingDB Entry DOI: 10.7270/Q25141H5
Sodium channel protein type 9 subunit alpha
(Homo sapiens (Human))
BDBM258107
(US9493448, 9 | US9845313, Example 9)
Show SMILES Cn1nccc1[C@H]1CCCCC[C@@H]1Oc1cc(F)c(cc1F)S(=O)(=O)Nc1ncns1 |r|
Show InChI InChI=1S/C19H21F2N5O3S2/c1-26-15(7-8-23-26)12-5-3-2-4-6-16(12)29-17-9-14(21)18(10-13(17)20)31(27,28)25-19-22-11-24-30-19/h7-12,16H,2-6H2,1H3,(H,22,24,25)/t12-,16+/m1/s1
US Patent
n/an/a 14n/an/an/an/a7.337
DAIICHI SANKYO COMPANY, LIMITED
US Patent
Assay Description
Current record was obtained by an automated patch clamp system IonWorks Quattro (Molecular Devices Corporation) in Population Patch Clamp mode. The o...
US Patent US9493448 (2016)
BindingDB Entry DOI: 10.7270/Q29022QD