null
SMILES: Cc1cc(c(F)cc1O[C@H]1CC(F)(F)CC[C@@H]1c1ccn[nH]1)S(=O)(=O)Nc1ccncn1
InChI Key:
Activity Spreadsheet -- Enzyme Inhibition Constant Data from BindingDB
Found 3 hits for monomerid = 258246
Trg + Lig
Ki
nM
ΔG°
kcal/mole
IC50
nM
Kd
nM
EC50/IC50
nM
koff
s-1
kon
M-1s-1
pHTemp
°C
Sodium channel protein type 9 subunit alpha
(Homo sapiens (Human))
BDBM258246
(US9493448, 155 | US9597330, Example 54 | US9845313...)
Show SMILES Cc1cc(c(F)cc1O[C@H]1CC(F)(F)CC[C@@H]1c1ccn[nH]1)S(=O)(=O)Nc1ccncn1 |r|
US Patent
n/an/a 28n/an/an/an/a7.337
DAIICHI SANKYO COMPANY, LIMITED
US Patent
Assay Description
Current record was obtained by an automated patch clamp system IonWorks Quattro (Molecular Devices Corporation) in Population Patch Clamp mode. The o...
US Patent US9493448 (2016)
BindingDB Entry DOI: 10.7270/Q29022QD
Sodium channel protein type 9 subunit alpha
(Homo sapiens (Human))
BDBM258246
(US9493448, 155 | US9597330, Example 54 | US9845313...)
Show SMILES Cc1cc(c(F)cc1O[C@H]1CC(F)(F)CC[C@@H]1c1ccn[nH]1)S(=O)(=O)Nc1ccncn1 |r|
US Patent
n/an/a 28n/an/an/an/an/an/a
DAIICHI SANKYO COMPANY, LIMITED
US Patent
Assay Description
Current record was obtained by an automated patch clamp system “IonWorks Quattro (Molecular Devices Corporation)” in Population Patch Clamp mode. The...
US Patent US9845313 (2017)
BindingDB Entry DOI: 10.7270/Q25141H5
Sodium channel protein type 9 subunit alpha
(Homo sapiens (Human))
BDBM258246
(US9493448, 155 | US9597330, Example 54 | US9845313...)
Show SMILES Cc1cc(c(F)cc1O[C@H]1CC(F)(F)CC[C@@H]1c1ccn[nH]1)S(=O)(=O)Nc1ccncn1 |r|
US Patent
n/an/a 28n/an/an/an/an/an/a
Daiichi Sankyo Company, Limited
US Patent
Assay Description
Current recording was obtained by an automated patch clamp system IonWorks Quattro (Molecular Devices Corporation) in Population Patch Clamp mode. Th...
US Patent US9597330 (2017)
BindingDB Entry DOI: 10.7270/Q28054PM