BDBM258467 US9522888, 692
SMILES: COCCCCC[C@H]1CCc2cc(ccc2C1)[C@@H]1CC[C@](N)(COP(O)(O)=O)C1
InChI Key: InChIKey=ZJPSQGKCYKMKSJ-MTNREXPMSA-N
Data: 1 IC50  2 EC50
Activity Spreadsheet -- Enzyme Inhibition Constant Data from BindingDB
Found 3 hits for monomerid = 258467
Trg + Lig
Ki
nM
ΔG°
kcal/mole
IC50
nM
Kd
nM
EC50/IC50
nM
koff
s-1
kon
M-1s-1
pHTemp
°C
Sphingosine 1-phosphate receptor 1
(Homo sapiens (Human))
BDBM258467
(US9522888, 692)
Show SMILES COCCCCC[C@H]1CCc2cc(ccc2C1)[C@@H]1CC[C@](N)(COP(O)(O)=O)C1 |r|
Show InChI InChI=1S/C22H36NO5P/c1-27-12-4-2-3-5-17-6-7-19-14-20(9-8-18(19)13-17)21-10-11-22(23,15-21)16-28-29(24,25)26/h8-9,14,17,21H,2-7,10-13,15-16,23H2,1H3,(H2,24,25,26)/t17-,21+,22+/m0/s1
Reactome pathway
US Patent
n/an/an/an/a 4.40n/an/an/a60
Bristol-Myers Squibb Company
US Patent
Assay Description
Compounds were loaded in a 384 Falcon v-bottom plate (0.5 ul/well in a 11 point, 3-fold dilution). Membranes prepared from S1P1/CHO cells or EDG3-Gal...
US Patent US9522888 (2016)
BindingDB Entry DOI: 10.7270/Q20K27HV
Sphingosine 1-phosphate receptor 1
(Homo sapiens (Human))
BDBM258467
(US9522888, 692)
Show SMILES COCCCCC[C@H]1CCc2cc(ccc2C1)[C@@H]1CC[C@](N)(COP(O)(O)=O)C1 |r|
Show InChI InChI=1S/C22H36NO5P/c1-27-12-4-2-3-5-17-6-7-19-14-20(9-8-18(19)13-17)21-10-11-22(23,15-21)16-28-29(24,25)26/h8-9,14,17,21H,2-7,10-13,15-16,23H2,1H3,(H2,24,25,26)/t17-,21+,22+/m0/s1
Reactome pathway
US Patent
n/an/a 2.30n/an/an/an/a7.525
Bristol-Myers Squibb Company
US Patent
Assay Description
Membranes were prepared from CHO cells expressing human S1P1. Cells pellets (1x10^9 cells/pellet) were suspended in buffer containing 20 mM HEPES (4-...
US Patent US9522888 (2016)
BindingDB Entry DOI: 10.7270/Q20K27HV
Sphingosine 1-phosphate receptor 3
(Homo sapiens (Human))
BDBM258467
(US9522888, 692)
Show SMILES COCCCCC[C@H]1CCc2cc(ccc2C1)[C@@H]1CC[C@](N)(COP(O)(O)=O)C1 |r|
Show InChI InChI=1S/C22H36NO5P/c1-27-12-4-2-3-5-17-6-7-19-14-20(9-8-18(19)13-17)21-10-11-22(23,15-21)16-28-29(24,25)26/h8-9,14,17,21H,2-7,10-13,15-16,23H2,1H3,(H2,24,25,26)/t17-,21+,22+/m0/s1
NCI pathway
Reactome pathway
US Patent
n/an/an/an/a>625n/an/an/a60
Bristol-Myers Squibb Company
US Patent
Assay Description
Compounds were loaded in a 384 Falcon v-bottom plate (0.5 ul/well in a 11 point, 3-fold dilution). Membranes prepared from S1P1/CHO cells or EDG3-Gal...
US Patent US9522888 (2016)
BindingDB Entry DOI: 10.7270/Q20K27HV