BDBM258525 US10633384, Example 6.4::US9493486, 6.4
SMILES: Clc1cc(Cl)cc(\C=C\C(=O)N2CCC3(CN(C3)C(=O)c3ccc4[nH]c(=O)oc4c3)CC2)c1
InChI Key: InChIKey=XCGGPJPPGDCVNV-DAFODLJHSA-N
Data: 2 IC50
Activity Spreadsheet -- Enzyme Inhibition Constant Data from BindingDB
Found 2 hits for monomerid = 258525
Trg + Lig
Ki
nM
ΔG°
kcal/mole
IC50
nM
Kd
nM
EC50/IC50
nM
koff
s-1
kon
M-1s-1
pHTemp
°C
Ataxin-2
(Homo sapiens (Human))
BDBM258525
(US10633384, Example 6.4 | US9493486, 6.4)
Show SMILES Clc1cc(Cl)cc(\C=C\C(=O)N2CCC3(CN(C3)C(=O)c3ccc4[nH]c(=O)oc4c3)CC2)c1
Show InChI InChI=1S/C24H21Cl2N3O4/c25-17-9-15(10-18(26)12-17)1-4-21(30)28-7-5-24(6-8-28)13-29(14-24)22(31)16-2-3-19-20(11-16)33-23(32)27-19/h1-4,9-12H,5-8,13-14H2,(H,27,32)/b4-1+
US Patent
n/an/a 22n/an/an/an/an/an/a
Hoffmann-La Roche Inc.
US Patent
Assay Description
ATX inhibition was measured by a fluorescence quenching assay using a specifically labeled substrate analogue (MR121 substrate). To obtain this MR121...
US Patent US10633384 (2020)
Ectonucleotide pyrophosphatase/phosphodiesterase family member 2
(Homo sapiens (Human))
BDBM258525
(US10633384, Example 6.4 | US9493486, 6.4)
Show SMILES Clc1cc(Cl)cc(\C=C\C(=O)N2CCC3(CN(C3)C(=O)c3ccc4[nH]c(=O)oc4c3)CC2)c1
Show InChI InChI=1S/C24H21Cl2N3O4/c25-17-9-15(10-18(26)12-17)1-4-21(30)28-7-5-24(6-8-28)13-29(14-24)22(31)16-2-3-19-20(11-16)33-23(32)27-19/h1-4,9-12H,5-8,13-14H2,(H,27,32)/b4-1+
US Patent
n/an/a 22n/an/an/an/a8.030
Hoffmann-La Roches Inc.
US Patent
Assay Description
ATX inhibition was measured by a fluorescence quenching assay using a specifically labeled substrate analogue (MR121 substrate). To obtain this MR121...
US Patent US9493486 (2016)
BindingDB Entry DOI: 10.7270/Q2VT1R1K