BDBM258715 US9499482, 114
SMILES: Clc1cc(ccc1OCCN1CCCC1)N1CC[C@H](Oc2ccc(cc2)-c2ccccc2)C1=O
InChI Key: InChIKey=NSUQNJPJRDHJBW-MHZLTWQESA-N
Data: 1 KI
Activity Spreadsheet -- Enzyme Inhibition Constant Data from BindingDB
Found 1 hit for monomerid = 258715
Trg + Lig
Ki
nM
ΔG°
kcal/mole
IC50
nM
Kd
nM
EC50/IC50
nM
koff
s-1
kon
M-1s-1
pHTemp
°C
Melanin-concentrating hormone receptor 1 (MCHR1)(E4Q)(A5T)
(Homo sapiens (Human))
BDBM258715
(US9499482, 114)
Show SMILES Clc1cc(ccc1OCCN1CCCC1)N1CC[C@H](Oc2ccc(cc2)-c2ccccc2)C1=O |r|
Show InChI InChI=1S/C28H29ClN2O3/c29-25-20-23(10-13-26(25)33-19-18-30-15-4-5-16-30)31-17-14-27(28(31)32)34-24-11-8-22(9-12-24)21-6-2-1-3-7-21/h1-3,6-13,20,27H,4-5,14-19H2/t27-/m0/s1
US Patent
0.5n/an/an/an/an/an/a7.4n/a
Bristol-Myers Squibb Company
US Patent
Assay Description
An in vitro binding assay was used to determine the compound Ki value or ability to antagonize binding of a peptide agonist to the human melanin conc...
US Patent US9499482 (2016)
BindingDB Entry DOI: 10.7270/Q2M907KT