BDBM258787 US9499482, 205
SMILES: O=C1N(CC=C1Oc1ccc(cc1)C1CC1)c1ccc(OCCN2CCCC2)c(c1)C1CC1
InChI Key: InChIKey=WURCNVIRYVTAGR-UHFFFAOYSA-N
Data: 1 KI
Activity Spreadsheet -- Enzyme Inhibition Constant Data from BindingDB
Found 1 hit for monomerid = 258787
Trg + Lig
Ki
nM
ΔG°
kcal/mole
IC50
nM
Kd
nM
EC50/IC50
nM
koff
s-1
kon
M-1s-1
pHTemp
°C
Melanin-concentrating hormone receptor 1 (MCHR1)(E4Q)(A5T)
(Homo sapiens (Human))
BDBM258787
(US9499482, 205)
Show SMILES O=C1N(CC=C1Oc1ccc(cc1)C1CC1)c1ccc(OCCN2CCCC2)c(c1)C1CC1 |c:4|
Show InChI InChI=1S/C28H32N2O3/c31-28-27(33-24-10-7-21(8-11-24)20-3-4-20)13-16-30(28)23-9-12-26(25(19-23)22-5-6-22)32-18-17-29-14-1-2-15-29/h7-13,19-20,22H,1-6,14-18H2
US Patent
0.600n/an/an/an/an/an/a7.4n/a
Bristol-Myers Squibb Company
US Patent
Assay Description
An in vitro binding assay was used to determine the compound Ki value or ability to antagonize binding of a peptide agonist to the human melanin conc...
US Patent US9499482 (2016)
BindingDB Entry DOI: 10.7270/Q2M907KT