BDBM258793 US9499482, 212
SMILES: COc1cc(ccc1OCCN1CC(O)C1)N1CC=C(Oc2ccc(cc2)-c2ccccc2)C1=O
InChI Key: InChIKey=APGWGVCWLYVCSY-UHFFFAOYSA-N
Data: 1 KI
Activity Spreadsheet -- Enzyme Inhibition Constant Data from BindingDB
Found 1 hit for monomerid = 258793
Trg + Lig
Ki
nM
ΔG°
kcal/mole
IC50
nM
Kd
nM
EC50/IC50
nM
koff
s-1
kon
M-1s-1
pHTemp
°C
Melanin-concentrating hormone receptor 1 (MCHR1)(E4Q)(A5T)
(Homo sapiens (Human))
BDBM258793
(US9499482, 212)
Show SMILES COc1cc(ccc1OCCN1CC(O)C1)N1CC=C(Oc2ccc(cc2)-c2ccccc2)C1=O |t:20|
Show InChI InChI=1S/C28H28N2O5/c1-33-27-17-22(9-12-25(27)34-16-15-29-18-23(31)19-29)30-14-13-26(28(30)32)35-24-10-7-21(8-11-24)20-5-3-2-4-6-20/h2-13,17,23,31H,14-16,18-19H2,1H3
US Patent
0.5n/an/an/an/an/an/a7.4n/a
Bristol-Myers Squibb Company
US Patent
Assay Description
An in vitro binding assay was used to determine the compound Ki value or ability to antagonize binding of a peptide agonist to the human melanin conc...
US Patent US9499482 (2016)
BindingDB Entry DOI: 10.7270/Q2M907KT