BDBM258794 US9499482, 213
SMILES: COc1cc(ccc1OCCN1CCCC1)N1CC=C(Oc2ccc(cc2)-c2ccccc2)C1=O
InChI Key: InChIKey=RJUYVCCMQGUBAF-UHFFFAOYSA-N
Data: 1 KI
Activity Spreadsheet -- Enzyme Inhibition Constant Data from BindingDB
Found 1 hit for monomerid = 258794
Trg + Lig
Ki
nM
ΔG°
kcal/mole
IC50
nM
Kd
nM
EC50/IC50
nM
koff
s-1
kon
M-1s-1
pHTemp
°C
Melanin-concentrating hormone receptor 1 (MCHR1)(E4Q)(A5T)
(Homo sapiens (Human))
BDBM258794
(US9499482, 213)
Show SMILES COc1cc(ccc1OCCN1CCCC1)N1CC=C(Oc2ccc(cc2)-c2ccccc2)C1=O |t:20|
Show InChI InChI=1S/C29H30N2O4/c1-33-28-21-24(11-14-26(28)34-20-19-30-16-5-6-17-30)31-18-15-27(29(31)32)35-25-12-9-23(10-13-25)22-7-3-2-4-8-22/h2-4,7-15,21H,5-6,16-20H2,1H3
US Patent
0.300n/an/an/an/an/an/a7.4n/a
Bristol-Myers Squibb Company
US Patent
Assay Description
An in vitro binding assay was used to determine the compound Ki value or ability to antagonize binding of a peptide agonist to the human melanin conc...
US Patent US9499482 (2016)
BindingDB Entry DOI: 10.7270/Q2M907KT