BDBM258797 US9499482, 216
SMILES: COc1cc(ccc1OCCN1CCCCC1)N1CC=C(Oc2ccc(cc2)-c2ccccc2)C1=O
InChI Key: InChIKey=WFHCBQRANNBSEW-UHFFFAOYSA-N
Data: 1 KI
Activity Spreadsheet -- Enzyme Inhibition Constant Data from BindingDB
Found 1 hit for monomerid = 258797
Trg + Lig
Ki
nM
ΔG°
kcal/mole
IC50
nM
Kd
nM
EC50/IC50
nM
koff
s-1
kon
M-1s-1
pHTemp
°C
Melanin-concentrating hormone receptor 1 (MCHR1)(E4Q)(A5T)
(Homo sapiens (Human))
BDBM258797
(US9499482, 216)
Show SMILES COc1cc(ccc1OCCN1CCCCC1)N1CC=C(Oc2ccc(cc2)-c2ccccc2)C1=O |t:21|
Show InChI InChI=1S/C30H32N2O4/c1-34-29-22-25(12-15-27(29)35-21-20-31-17-6-3-7-18-31)32-19-16-28(30(32)33)36-26-13-10-24(11-14-26)23-8-4-2-5-9-23/h2,4-5,8-16,22H,3,6-7,17-21H2,1H3
US Patent
0.400n/an/an/an/an/an/a7.4n/a
Bristol-Myers Squibb Company
US Patent
Assay Description
An in vitro binding assay was used to determine the compound Ki value or ability to antagonize binding of a peptide agonist to the human melanin conc...
US Patent US9499482 (2016)
BindingDB Entry DOI: 10.7270/Q2M907KT