BDBM258996 US9499502, 9cr-a
SMILES: C[C@]1(CS(=O)(=O)[C@@](C)(CC2CCOCC2)C(=N)N1)c1cc(NC(=O)c2ccc(F)cn2)ccc1F
InChI Key: InChIKey=PYKXQYRULDMMMH-ZEQRLZLVSA-N
Data: 2 KI
Activity Spreadsheet -- Enzyme Inhibition Constant Data from BindingDB
Found 2 hits for monomerid = 258996
Trg + Lig
Ki
nM
ΔG°
kcal/mole
IC50
nM
Kd
nM
EC50/IC50
nM
koff
s-1
kon
M-1s-1
pHTemp
°C
Beta-secretase 1
(Homo sapiens (Human))
BDBM258996
(US9499502, 9cr-a)
Show SMILES C[C@]1(CS(=O)(=O)[C@@](C)(CC2CCOCC2)C(=N)N1)c1cc(NC(=O)c2ccc(F)cn2)ccc1F |r|
Show InChI InChI=1S/C24H28F2N4O4S/c1-23(14-35(32,33)24(2,22(27)30-23)12-15-7-9-34-10-8-15)18-11-17(4-5-19(18)26)29-21(31)20-6-3-16(25)13-28-20/h3-6,11,13,15H,7-10,12,14H2,1-2H3,(H2,27,30)(H,29,31)/t23-,24-/m0/s1
US Patent
2.10 -12.0n/an/an/an/an/a5.030
Merck Sharp & Dohme Corp.
US Patent
Assay Description
A homogeneous time-resolved FRET assay can be used to determine IC50 values for inhibitors of the soluble human BACE1 catalytic domain. This assay mo...
US Patent US9499502 (2016)
BindingDB Entry DOI: 10.7270/Q2BV7FJJ
Beta-secretase 2
(Homo sapiens (Human))
BDBM258996
(US9499502, 9cr-a)
Show SMILES C[C@]1(CS(=O)(=O)[C@@](C)(CC2CCOCC2)C(=N)N1)c1cc(NC(=O)c2ccc(F)cn2)ccc1F |r|
Show InChI InChI=1S/C24H28F2N4O4S/c1-23(14-35(32,33)24(2,22(27)30-23)12-15-7-9-34-10-8-15)18-11-17(4-5-19(18)26)29-21(31)20-6-3-16(25)13-28-20/h3-6,11,13,15H,7-10,12,14H2,1-2H3,(H2,27,30)(H,29,31)/t23-,24-/m0/s1
US Patent
<10<-11.1n/an/an/an/an/a5.030
Merck Sharp & Dohme Corp.
US Patent
Assay Description
Inhibitor IC50s at purified human autoBACE-2 are determined in a time-resolved endpoint proteolysis assay that measures hydrolysis of the QSY7-EISEVN...
US Patent US9499502 (2016)
BindingDB Entry DOI: 10.7270/Q2BV7FJJ