BDBM258998 US9499502, 9ct-a
SMILES: COc1cnc(cn1)C(=O)Nc1ccc(F)c(c1)[C@]1(C)CS(=O)(=O)[C@@](C)(CC2CCOCC2)C(=N)N1
InChI Key: InChIKey=XSWUKTIPUCIOSI-ZEQRLZLVSA-N
Data: 2 KI
Activity Spreadsheet -- Enzyme Inhibition Constant Data from BindingDB
Found 2 hits for monomerid = 258998
Trg + Lig
Ki
nM
ΔG°
kcal/mole
IC50
nM
Kd
nM
EC50/IC50
nM
koff
s-1
kon
M-1s-1
pHTemp
°C
Beta-secretase 1
(Homo sapiens (Human))
BDBM258998
(US9499502, 9ct-a)
Show SMILES COc1cnc(cn1)C(=O)Nc1ccc(F)c(c1)[C@]1(C)CS(=O)(=O)[C@@](C)(CC2CCOCC2)C(=N)N1 |r|
Show InChI InChI=1S/C24H30FN5O5S/c1-23(14-36(32,33)24(2,22(26)30-23)11-15-6-8-35-9-7-15)17-10-16(4-5-18(17)25)29-21(31)19-12-28-20(34-3)13-27-19/h4-5,10,12-13,15H,6-9,11,14H2,1-3H3,(H2,26,30)(H,29,31)/t23-,24-/m0/s1
US Patent
3.90 -11.7n/an/an/an/an/a5.030
Merck Sharp & Dohme Corp.
US Patent
Assay Description
A homogeneous time-resolved FRET assay can be used to determine IC50 values for inhibitors of the soluble human BACE1 catalytic domain. This assay mo...
US Patent US9499502 (2016)
BindingDB Entry DOI: 10.7270/Q2BV7FJJ
Beta-secretase 2
(Homo sapiens (Human))
BDBM258998
(US9499502, 9ct-a)
Show SMILES COc1cnc(cn1)C(=O)Nc1ccc(F)c(c1)[C@]1(C)CS(=O)(=O)[C@@](C)(CC2CCOCC2)C(=N)N1 |r|
Show InChI InChI=1S/C24H30FN5O5S/c1-23(14-36(32,33)24(2,22(26)30-23)11-15-6-8-35-9-7-15)17-10-16(4-5-18(17)25)29-21(31)19-12-28-20(34-3)13-27-19/h4-5,10,12-13,15H,6-9,11,14H2,1-3H3,(H2,26,30)(H,29,31)/t23-,24-/m0/s1
US Patent
<10<-11.1n/an/an/an/an/a5.030
Merck Sharp & Dohme Corp.
US Patent
Assay Description
Inhibitor IC50s at purified human autoBACE-2 are determined in a time-resolved endpoint proteolysis assay that measures hydrolysis of the QSY7-EISEVN...
US Patent US9499502 (2016)
BindingDB Entry DOI: 10.7270/Q2BV7FJJ