null
SMILES: CC(C)(CCN)Oc1ccc2ncc(-c3cc4ccccc4o3)n2n1
InChI Key: InChIKey=WBVUGALQOCVIOW-UHFFFAOYSA-N
Activity Spreadsheet -- Enzyme Inhibition Constant Data from BindingDB
Found 2 hits for monomerid = 259269
Trg + Lig
Ki
nM
ΔG°
kcal/mole
IC50
nM
Kd
nM
EC50/IC50
nM
koff
s-1
kon
M-1s-1
pHTemp
°C
Glutathione S-transferase P/Isoform 2 of MAP kinase-interacting serine/threonine-protein kinase 1 (MNK1a) [T344D]
(Homo sapiens (Human))
BDBM259269
(US9499547, 10)
Show SMILES CC(C)(CCN)Oc1ccc2ncc(-c3cc4ccccc4o3)n2n1
Show InChI InChI=1S/C19H20N4O2/c1-19(2,9-10-20)25-18-8-7-17-21-12-14(23(17)22-18)16-11-13-5-3-4-6-15(13)24-16/h3-8,11-12H,9-10,20H2,1-2H3
Reactome pathway
US Patent
n/an/a 31n/an/an/an/a7.522
BAYER INTELLECTUAL PROPERTY GMBH
US Patent
Assay Description
MKNK1-inhibitory activity at high ATP of compounds of the present invention after their preincubation with MKNK1 was quantified employing the TR-FRET...
US Patent US9499547 (2016)
BindingDB Entry DOI: 10.7270/Q2736PVK
Glutathione S-transferase P/Isoform 2 of MAP kinase-interacting serine/threonine-protein kinase 1 (MNK1a) [T344D]
(Homo sapiens (Human))
BDBM259269
(US9499547, 10)
Show SMILES CC(C)(CCN)Oc1ccc2ncc(-c3cc4ccccc4o3)n2n1
Show InChI InChI=1S/C19H20N4O2/c1-19(2,9-10-20)25-18-8-7-17-21-12-14(23(17)22-18)16-11-13-5-3-4-6-15(13)24-16/h3-8,11-12H,9-10,20H2,1-2H3
Reactome pathway
US Patent
n/an/a 8n/an/an/an/a7.522
BAYER INTELLECTUAL PROPERTY GMBH
US Patent
Assay Description
A recombinant fusion protein of Glutathione-S-Transferase (GST, N-terminally) and human full-length MKNK1 (amino acids 1-424 and T344D of accession n...
US Patent US9499547 (2016)
BindingDB Entry DOI: 10.7270/Q2736PVK