BDBM259334 US9505745, 11::US9790212, Example 11
SMILES: CCN(C1CCN(CC1)C(=O)OC(C)(C)C)c1scc(C(=O)NCc2c(C)cc(C)[nH]c2=O)c1C
InChI Key: InChIKey=ZASAZMPROUJDHA-UHFFFAOYSA-N
Data: 4 IC50
Activity Spreadsheet -- Enzyme Inhibition Constant Data from BindingDB
Found 4 hits for monomerid = 259334
Trg + Lig
Ki
nM
ΔG°
kcal/mole
IC50
nM
Kd
nM
EC50/IC50
nM
koff
s-1
kon
M-1s-1
pHTemp
°C
PRC2 complex
(Homo sapiens (Human))
BDBM259334
(US9505745, 11 | US9790212, Example 11)
Show SMILES CCN(C1CCN(CC1)C(=O)OC(C)(C)C)c1scc(C(=O)NCc2c(C)cc(C)[nH]c2=O)c1C
Show InChI InChI=1S/C26H38N4O4S/c1-8-30(19-9-11-29(12-10-19)25(33)34-26(5,6)7)24-18(4)21(15-35-24)22(31)27-14-20-16(2)13-17(3)28-23(20)32/h13,15,19H,8-12,14H2,1-7H3,(H,27,31)(H,28,32)
US Patent
n/an/a 16n/an/an/an/an/an/a
GlaxoSmithKline Intellectual Property (No. 2) Limited
US Patent
Assay Description
Protocol 1: Compounds contained herein were evaluated for their ability to inhibit the methyltransferase activity of EZH2 within the PRC2 complex. Hu...
US Patent US9505745 (2016)
BindingDB Entry DOI: 10.7270/Q23B5Z3T
PRC2 complex
(Homo sapiens (Human))
BDBM259334
(US9505745, 11 | US9790212, Example 11)
Show SMILES CCN(C1CCN(CC1)C(=O)OC(C)(C)C)c1scc(C(=O)NCc2c(C)cc(C)[nH]c2=O)c1C
Show InChI InChI=1S/C26H38N4O4S/c1-8-30(19-9-11-29(12-10-19)25(33)34-26(5,6)7)24-18(4)21(15-35-24)22(31)27-14-20-16(2)13-17(3)28-23(20)32/h13,15,19H,8-12,14H2,1-7H3,(H,27,31)(H,28,32)
US Patent
n/an/a 20n/an/an/an/an/an/a
GLAXOSMITHKLINE INTELLECTUAL PROPERTY (NO. 2) LIMITED
US Patent
Assay Description
Compounds contained herein were evaluated for their ability to inhibit the methyltransferase activity of EZH2 within the PRC2 complex. Human PRC2 com...
US Patent US9790212 (2017)
BindingDB Entry DOI: 10.7270/Q2PZ5BZ2
PRC2 complex
(Homo sapiens (Human))
BDBM259334
(US9505745, 11 | US9790212, Example 11)
Show SMILES CCN(C1CCN(CC1)C(=O)OC(C)(C)C)c1scc(C(=O)NCc2c(C)cc(C)[nH]c2=O)c1C
Show InChI InChI=1S/C26H38N4O4S/c1-8-30(19-9-11-29(12-10-19)25(33)34-26(5,6)7)24-18(4)21(15-35-24)22(31)27-14-20-16(2)13-17(3)28-23(20)32/h13,15,19H,8-12,14H2,1-7H3,(H,27,31)(H,28,32)
US Patent
n/an/a 16n/an/an/an/an/an/a
GLAXOSMITHKLINE INTELLECTUAL PROPERTY (NO. 2) LIMITED
US Patent
Assay Description
Compounds contained herein were evaluated for their ability to inhibit the methyltransferase activity of EZH2 within the PRC2 complex. Human PRC2 com...
US Patent US9790212 (2017)
BindingDB Entry DOI: 10.7270/Q2PZ5BZ2
PRC2 complex
(Homo sapiens (Human))
BDBM259334
(US9505745, 11 | US9790212, Example 11)
Show SMILES CCN(C1CCN(CC1)C(=O)OC(C)(C)C)c1scc(C(=O)NCc2c(C)cc(C)[nH]c2=O)c1C
Show InChI InChI=1S/C26H38N4O4S/c1-8-30(19-9-11-29(12-10-19)25(33)34-26(5,6)7)24-18(4)21(15-35-24)22(31)27-14-20-16(2)13-17(3)28-23(20)32/h13,15,19H,8-12,14H2,1-7H3,(H,27,31)(H,28,32)
US Patent
n/an/a 20n/an/an/an/an/an/a
GlaxoSmithKline Intellectual Property (No. 2) Limited
US Patent
Assay Description
Protocol 2: Compounds contained herein were evaluated for their ability to inhibit the methyltransferase activity of EZH2 within the PRC2 complex. Hu...
US Patent US9505745 (2016)
BindingDB Entry DOI: 10.7270/Q23B5Z3T