BDBM259402 US10457647, Example 1::US9512084, 1
SMILES: Cc1c(NC(=O)c2ccc(cc2F)C2CC2)cc(F)cc1-c1ncnc(N)c1OC1CN(C1)C(=O)C=C
InChI Key: InChIKey=OSLWRSOLKHYZCC-UHFFFAOYSA-N
Data: 5 IC50
Activity Spreadsheet -- Enzyme Inhibition Constant Data from BindingDB
Found 6 hits for monomerid = 259402
Trg + Lig
Ki
nM
ΔG°
kcal/mole
IC50
nM
Kd
nM
EC50/IC50
nM
koff
s-1
kon
M-1s-1
pHTemp
°C
Tyrosine-protein kinase BTK
(Homo sapiens (Human))
BDBM259402
(US10457647, Example 1 | US11180460, Example 1 | US...)
Show SMILES Cc1c(NC(=O)c2ccc(cc2F)C2CC2)cc(F)cc1-c1ncnc(N)c1OC1CN(C1)C(=O)C=C
Show InChI InChI=1S/C27H25F2N5O3/c1-3-23(35)34-11-18(12-34)37-25-24(31-13-32-26(25)30)20-9-17(28)10-22(14(20)2)33-27(36)19-7-6-16(8-21(19)29)15-4-5-15/h3,6-10,13,15,18H,1,4-5,11-12H2,2H3,(H,33,36)(H2,30,31,32)
NCI pathway
Reactome pathway
US Patent
n/an/a 2n/an/an/an/a7.530
Novartis AG
US Patent
Assay Description
The inhibitory activity of the present compounds against Btk was assessed in a biochemical enzyme assay. Assay plates in 384 well format were prepare...
US Patent US9512084 (2016)
BindingDB Entry DOI: 10.7270/Q2ZK5FMH
Tyrosine-protein kinase BTK
(Homo sapiens (Human))
BDBM259402
(US10457647, Example 1 | US11180460, Example 1 | US...)
Show SMILES Cc1c(NC(=O)c2ccc(cc2F)C2CC2)cc(F)cc1-c1ncnc(N)c1OC1CN(C1)C(=O)C=C
Show InChI InChI=1S/C27H25F2N5O3/c1-3-23(35)34-11-18(12-34)37-25-24(31-13-32-26(25)30)20-9-17(28)10-22(14(20)2)33-27(36)19-7-6-16(8-21(19)29)15-4-5-15/h3,6-10,13,15,18H,1,4-5,11-12H2,2H3,(H,33,36)(H2,30,31,32)
NCI pathway
Reactome pathway
US Patent
n/an/a 2n/an/an/an/an/an/a
Novartis AG
US Patent
Assay Description
The inhibitory activity of the present compounds against Btk was assessed in a biochemical enzyme assay. Assay plates in 384 well format were prepare...
US Patent US10457647 (2019)
BindingDB Entry DOI: 10.7270/Q2KH0QPQ
Tyrosine-protein kinase BTK
(Homo sapiens (Human))
BDBM259402
(US10457647, Example 1 | US11180460, Example 1 | US...)
Show SMILES Cc1c(NC(=O)c2ccc(cc2F)C2CC2)cc(F)cc1-c1ncnc(N)c1OC1CN(C1)C(=O)C=C
Show InChI InChI=1S/C27H25F2N5O3/c1-3-23(35)34-11-18(12-34)37-25-24(31-13-32-26(25)30)20-9-17(28)10-22(14(20)2)33-27(36)19-7-6-16(8-21(19)29)15-4-5-15/h3,6-10,13,15,18H,1,4-5,11-12H2,2H3,(H,33,36)(H2,30,31,32)
NCI pathway
Reactome pathway
n/an/a 2n/an/an/an/an/an/a
TBA
Citation and Details
Tyrosine-protein kinase BTK
(Homo sapiens (Human))
BDBM259402
(US10457647, Example 1 | US11180460, Example 1 | US...)
Show SMILES Cc1c(NC(=O)c2ccc(cc2F)C2CC2)cc(F)cc1-c1ncnc(N)c1OC1CN(C1)C(=O)C=C
Show InChI InChI=1S/C27H25F2N5O3/c1-3-23(35)34-11-18(12-34)37-25-24(31-13-32-26(25)30)20-9-17(28)10-22(14(20)2)33-27(36)19-7-6-16(8-21(19)29)15-4-5-15/h3,6-10,13,15,18H,1,4-5,11-12H2,2H3,(H,33,36)(H2,30,31,32)
NCI pathway
Reactome pathway
n/an/a 86n/an/an/an/an/an/a
TBA
Curated by ChEMBL
Assay Description
Inhibition of BTK in human B cells assessed as reduction in anti-IgM/IL4-stimulated CD69 expression on B cells preincubated for 60 mins followed by a...
J Med Chem 63: 5102-5118 (2020)
Article DOI: 10.1021/acs.jmedchem.9b01916
Tyrosine-protein kinase BTK
(Homo sapiens (Human))
BDBM259402
(US10457647, Example 1 | US11180460, Example 1 | US...)
Show SMILES Cc1c(NC(=O)c2ccc(cc2F)C2CC2)cc(F)cc1-c1ncnc(N)c1OC1CN(C1)C(=O)C=C
Show InChI InChI=1S/C27H25F2N5O3/c1-3-23(35)34-11-18(12-34)37-25-24(31-13-32-26(25)30)20-9-17(28)10-22(14(20)2)33-27(36)19-7-6-16(8-21(19)29)15-4-5-15/h3,6-10,13,15,18H,1,4-5,11-12H2,2H3,(H,33,36)(H2,30,31,32)
NCI pathway
Reactome pathway
n/an/a 20n/an/an/an/an/an/a
TBA
Curated by ChEMBL
Assay Description
Inhibition of BTK in vitamin D3 differentiated human THP1 cells assessed as inhibition of FCgammaR-induced IL8 production measured after 24 hrs by HT...
J Med Chem 63: 5102-5118 (2020)
Article DOI: 10.1021/acs.jmedchem.9b01916
Tyrosine-protein kinase BTK
(Homo sapiens (Human))
BDBM259402
(US10457647, Example 1 | US11180460, Example 1 | US...)
Show SMILES Cc1c(NC(=O)c2ccc(cc2F)C2CC2)cc(F)cc1-c1ncnc(N)c1OC1CN(C1)C(=O)C=C
Show InChI InChI=1S/C27H25F2N5O3/c1-3-23(35)34-11-18(12-34)37-25-24(31-13-32-26(25)30)20-9-17(28)10-22(14(20)2)33-27(36)19-7-6-16(8-21(19)29)15-4-5-15/h3,6-10,13,15,18H,1,4-5,11-12H2,2H3,(H,33,36)(H2,30,31,32)
NCI pathway
Reactome pathway
n/an/a 4.5n/an/an/an/an/an/a
TBA
Curated by ChEMBL
Assay Description
Inhibition of full-length human recombinant BTK using FITC-Ahx-TSELKKVVALYDYMPMNAND-NH2 as substrate measured after 60 mins by caliper assay
J Med Chem 63: 5102-5118 (2020)
Article DOI: 10.1021/acs.jmedchem.9b01916