BDBM259424 US10457647, Example 23::US9512084, 23
SMILES: CC#CC(=O)N1CCC[C@H]1COc1c(N)ncnc1-c1cc(F)cc(NC(=O)c2ccc(cc2F)C2CC2)c1C
InChI Key: InChIKey=KEMHEPGJSVHZOB-NRFANRHFSA-N
Data: 2 IC50
Activity Spreadsheet -- Enzyme Inhibition Constant Data from BindingDB
Found 2 hits for monomerid = 259424
Trg + Lig
Ki
nM
ΔG°
kcal/mole
IC50
nM
Kd
nM
EC50/IC50
nM
koff
s-1
kon
M-1s-1
pHTemp
°C
Tyrosine-protein kinase BTK
(Homo sapiens (Human))
BDBM259424
(US10457647, Example 23 | US9512084, 23)
Show SMILES CC#CC(=O)N1CCC[C@H]1COc1c(N)ncnc1-c1cc(F)cc(NC(=O)c2ccc(cc2F)C2CC2)c1C |r|
Show InChI InChI=1S/C30H29F2N5O3/c1-3-5-26(38)37-11-4-6-21(37)15-40-28-27(34-16-35-29(28)33)23-13-20(31)14-25(17(23)2)36-30(39)22-10-9-19(12-24(22)32)18-7-8-18/h9-10,12-14,16,18,21H,4,6-8,11,15H2,1-2H3,(H,36,39)(H2,33,34,35)/t21-/m0/s1
NCI pathway
Reactome pathway
US Patent
n/an/a 1n/an/an/an/an/an/a
Novartis AG
US Patent
Assay Description
The inhibitory activity of the present compounds against Btk was assessed in a biochemical enzyme assay. Assay plates in 384 well format were prepare...
US Patent US10457647 (2019)
BindingDB Entry DOI: 10.7270/Q2KH0QPQ
Tyrosine-protein kinase BTK
(Homo sapiens (Human))
BDBM259424
(US10457647, Example 23 | US9512084, 23)
Show SMILES CC#CC(=O)N1CCC[C@H]1COc1c(N)ncnc1-c1cc(F)cc(NC(=O)c2ccc(cc2F)C2CC2)c1C |r|
Show InChI InChI=1S/C30H29F2N5O3/c1-3-5-26(38)37-11-4-6-21(37)15-40-28-27(34-16-35-29(28)33)23-13-20(31)14-25(17(23)2)36-30(39)22-10-9-19(12-24(22)32)18-7-8-18/h9-10,12-14,16,18,21H,4,6-8,11,15H2,1-2H3,(H,36,39)(H2,33,34,35)/t21-/m0/s1
NCI pathway
Reactome pathway
US Patent
n/an/a 1n/an/an/an/a7.530
Novartis AG
US Patent
Assay Description
The inhibitory activity of the present compounds against Btk was assessed in a biochemical enzyme assay. Assay plates in 384 well format were prepare...
US Patent US9512084 (2016)
BindingDB Entry DOI: 10.7270/Q2ZK5FMH