null
SMILES: Cc1cc(ccc1C(=O)NC1CC1)-c1cnc2c(NCCC(F)(F)F)cc(nn12)C(C)(O)c1cccc(F)c1O
InChI Key: InChIKey=DSCYGDOLRIGYLN-UHFFFAOYSA-N
Activity Spreadsheet -- Enzyme Inhibition Constant Data from BindingDB
Found 1 hit for monomerid = 259467
Trg + Lig
Ki
nM
ΔG°
kcal/mole
IC50
nM
Kd
nM
EC50/IC50
nM
koff
s-1
kon
M-1s-1
pHTemp
°C
Dual specificity protein kinase TTK/Glutathione S-transferase P
(Homo sapiens (Human))
BDBM259467
(US9512126, 4)
Show SMILES Cc1cc(ccc1C(=O)NC1CC1)-c1cnc2c(NCCC(F)(F)F)cc(nn12)C(C)(O)c1cccc(F)c1O |w:29.34,29.33|
Show InChI InChI=1S/C28H27F4N5O3/c1-15-12-16(6-9-18(15)26(39)35-17-7-8-17)22-14-34-25-21(33-11-10-28(30,31)32)13-23(36-37(22)25)27(2,40)19-4-3-5-20(29)24(19)38/h3-6,9,12-14,17,33,38,40H,7-8,10-11H2,1-2H3,(H,35,39)
US Patent
n/an/a 0.300n/an/an/an/a7.722
Bayer Intellectual Property GmbH
US Patent
Assay Description
The human kinase Mps-1 phosphorylates a biotinylated substrate peptide. Detection of the phosphorylated product is achieved by time-resolved fluoresc...
US Patent US9512126 (2016)
BindingDB Entry DOI: 10.7270/Q2Q23Z5S