BDBM259473 US9512126, 11
SMILES: Cc1cc(ccc1C(=O)NC1CC1)-c1cnc2c(NCCC(F)(F)F)cc(nn12)C(O)c1cc(F)ccc1F
InChI Key: InChIKey=FXMKHYPZZXYEFF-UHFFFAOYSA-N
Data: 1 IC50
Activity Spreadsheet -- Enzyme Inhibition Constant Data from BindingDB
Found 1 hit for monomerid = 259473
Trg + Lig
Ki
nM
ΔG°
kcal/mole
IC50
nM
Kd
nM
EC50/IC50
nM
koff
s-1
kon
M-1s-1
pHTemp
°C
GST-Dual specificity protein kinase TTK
(Homo sapiens (Human))
BDBM259473
(US9512126, 11)
Show SMILES Cc1cc(ccc1C(=O)NC1CC1)-c1cnc2c(NCCC(F)(F)F)cc(nn12)C(O)c1cc(F)ccc1F |w:29.33|
Show InChI InChI=1S/C27H24F5N5O2/c1-14-10-15(2-6-18(14)26(39)35-17-4-5-17)23-13-34-25-22(33-9-8-27(30,31)32)12-21(36-37(23)25)24(38)19-11-16(28)3-7-20(19)29/h2-3,6-7,10-13,17,24,33,38H,4-5,8-9H2,1H3,(H,35,39)
US Patent
n/an/a 0.300n/an/an/an/a7.722
Bayer Intellectual Property GmbH
US Patent
Assay Description
The human kinase Mps-1 phosphorylates a biotinylated substrate peptide. Detection of the phosphorylated product is achieved by time-resolved fluoresc...
US Patent US9512126 (2016)
BindingDB Entry DOI: 10.7270/Q2Q23Z5S