BDBM2596 (Arylindolyl)maleimide deriv. 18::3-(1H-indol-1-yl)-4-(1-methyl-1H-indol-3-yl)-2,5-dihydro-1H-pyrrole-2,5-dione
SMILES: Cn1cc(C2=C(C(=O)NC2=O)n2ccc3ccccc23)c2ccccc12
InChI Key: InChIKey=WERUZASLJJAWCD-UHFFFAOYSA-N
Data: 1 IC50
Activity Spreadsheet -- Enzyme Inhibition Constant Data from BindingDB
Found 1 hit for monomerid = 2596
Trg + Lig
Ki
nM
ΔG°
kcal/mole
IC50
nM
Kd
nM
EC50/IC50
nM
koff
s-1
kon
M-1s-1
pHTemp
°C
Protein Kinase C
(Rattus norvegicus (rat))
BDBM2596
((Arylindolyl)maleimide deriv. 18 | 3-(1H-indol-1-y...)
Show SMILES Cn1cc(C2=C(C(=O)NC2=O)n2ccc3ccccc23)c2ccccc12 |t:4|
Show InChI InChI=1S/C21H15N3O2/c1-23-12-15(14-7-3-5-9-17(14)23)18-19(21(26)22-20(18)25)24-11-10-13-6-2-4-8-16(13)24/h2-12H,1H3,(H,22,25,26)
n/an/a 3.00E+3n/an/an/an/a7.530
Roche Products Limited
Assay Description
The activity of PKC, activated by phosphatidylerine and Ca2+, is measured by its ability to transfer phosphate from [gamma-32P]ATP to lysine-rich his...
J Med Chem 35: 177-84 (1992)
Article DOI: 10.1021/jm00079a024
BindingDB Entry DOI: 10.7270/Q2K64G8V