BDBM259608 US9505749, 121
SMILES: COc1ccc(cc1)-c1nnc(o1)[C@H]1CC[C@@H](CC1)NC(=O)CCSc1nc2ccccc2c(=O)[nH]1
InChI Key:
Data: 4 IC50
Activity Spreadsheet -- Enzyme Inhibition Constant Data from BindingDB
Found 4 hits for monomerid = 259608
Trg + Lig
Ki
nM
ΔG°
kcal/mole
IC50
nM
Kd
nM
EC50/IC50
nM
koff
s-1
kon
M-1s-1
pHTemp
°C
Tankyrase-1
(Homo sapiens (Human))
BDBM259608
(US9505749, 121)
Show SMILES COc1ccc(cc1)-c1nnc(o1)[C@H]1CC[C@@H](CC1)NC(=O)CCSc1nc2ccccc2c(=O)[nH]1 |r,wU:16.21,wD:13.14,(12.71,-.12,;11.62,-1.21,;10.13,-.81,;9.04,-1.9,;7.55,-1.5,;7.15,-.01,;8.24,1.08,;9.73,.68,;5.67,.38,;4.76,1.63,;3.3,1.15,;3.3,-.38,;4.76,-.86,;1.96,-1.15,;.63,-.38,;-.7,-1.15,;-.7,-2.69,;.63,-3.47,;1.96,-2.69,;-2.04,-3.47,;-3.37,-2.69,;-3.37,-1.15,;-4.7,-3.47,;-6.04,-2.69,;-6.04,-1.15,;-7.37,-.38,;-8.71,-1.15,;-10.04,-.38,;-11.37,-1.15,;-12.71,-.38,;-12.71,1.15,;-11.37,1.93,;-10.04,1.15,;-8.71,1.93,;-8.71,3.47,;-7.37,1.15,)|
US Patent
n/an/a 0.0724n/an/an/an/an/an/a
AMGEN INC.
US Patent
Assay Description
The tankyrase 1 biochemical activity of the compounds was assayed in the following assay buffer (50 mM MOPS pH7.5, 100 mM NaCl, 2.5 mM MgCl2, 0.01% T...
US Patent US9505749 (2016)
BindingDB Entry DOI: 10.7270/Q2FN154F
Poly [ADP-ribose] polymerase 2
(Homo sapiens (Human))
BDBM259608
(US9505749, 121)
Show SMILES COc1ccc(cc1)-c1nnc(o1)[C@H]1CC[C@@H](CC1)NC(=O)CCSc1nc2ccccc2c(=O)[nH]1 |r,wU:16.21,wD:13.14,(12.71,-.12,;11.62,-1.21,;10.13,-.81,;9.04,-1.9,;7.55,-1.5,;7.15,-.01,;8.24,1.08,;9.73,.68,;5.67,.38,;4.76,1.63,;3.3,1.15,;3.3,-.38,;4.76,-.86,;1.96,-1.15,;.63,-.38,;-.7,-1.15,;-.7,-2.69,;.63,-3.47,;1.96,-2.69,;-2.04,-3.47,;-3.37,-2.69,;-3.37,-1.15,;-4.7,-3.47,;-6.04,-2.69,;-6.04,-1.15,;-7.37,-.38,;-8.71,-1.15,;-10.04,-.38,;-11.37,-1.15,;-12.71,-.38,;-12.71,1.15,;-11.37,1.93,;-10.04,1.15,;-8.71,1.93,;-8.71,3.47,;-7.37,1.15,)|
US Patent
n/an/a 6.78E+3n/an/an/an/an/an/a
AMGEN INC.
US Patent
Assay Description
PARP1 biochemical assay was purchased as a kit from Trevigen (cat.#4676-096-K) and used per manufacturers recommendations.PARP2 biochemical assay was...
US Patent US9505749 (2016)
BindingDB Entry DOI: 10.7270/Q2FN154F
Poly [ADP-ribose] polymerase 1
(Homo sapiens (Human))
BDBM259608
(US9505749, 121)
Show SMILES COc1ccc(cc1)-c1nnc(o1)[C@H]1CC[C@@H](CC1)NC(=O)CCSc1nc2ccccc2c(=O)[nH]1 |r,wU:16.21,wD:13.14,(12.71,-.12,;11.62,-1.21,;10.13,-.81,;9.04,-1.9,;7.55,-1.5,;7.15,-.01,;8.24,1.08,;9.73,.68,;5.67,.38,;4.76,1.63,;3.3,1.15,;3.3,-.38,;4.76,-.86,;1.96,-1.15,;.63,-.38,;-.7,-1.15,;-.7,-2.69,;.63,-3.47,;1.96,-2.69,;-2.04,-3.47,;-3.37,-2.69,;-3.37,-1.15,;-4.7,-3.47,;-6.04,-2.69,;-6.04,-1.15,;-7.37,-.38,;-8.71,-1.15,;-10.04,-.38,;-11.37,-1.15,;-12.71,-.38,;-12.71,1.15,;-11.37,1.93,;-10.04,1.15,;-8.71,1.93,;-8.71,3.47,;-7.37,1.15,)|
US Patent
n/an/a 4.43E+3n/an/an/an/an/an/a
AMGEN INC.
US Patent
Assay Description
PARP1 biochemical assay was purchased as a kit from Trevigen (cat.#4676-096-K) and used per manufacturers recommendations.PARP2 biochemical assay was...
US Patent US9505749 (2016)
BindingDB Entry DOI: 10.7270/Q2FN154F
Tankyrase-2
(Homo sapiens (Human))
BDBM259608
(US9505749, 121)
Show SMILES COc1ccc(cc1)-c1nnc(o1)[C@H]1CC[C@@H](CC1)NC(=O)CCSc1nc2ccccc2c(=O)[nH]1 |r,wU:16.21,wD:13.14,(12.71,-.12,;11.62,-1.21,;10.13,-.81,;9.04,-1.9,;7.55,-1.5,;7.15,-.01,;8.24,1.08,;9.73,.68,;5.67,.38,;4.76,1.63,;3.3,1.15,;3.3,-.38,;4.76,-.86,;1.96,-1.15,;.63,-.38,;-.7,-1.15,;-.7,-2.69,;.63,-3.47,;1.96,-2.69,;-2.04,-3.47,;-3.37,-2.69,;-3.37,-1.15,;-4.7,-3.47,;-6.04,-2.69,;-6.04,-1.15,;-7.37,-.38,;-8.71,-1.15,;-10.04,-.38,;-11.37,-1.15,;-12.71,-.38,;-12.71,1.15,;-11.37,1.93,;-10.04,1.15,;-8.71,1.93,;-8.71,3.47,;-7.37,1.15,)|
US Patent
n/an/a 18.1n/an/an/an/an/an/a
AMGEN INC.
US Patent
Assay Description
The tankyrase 1 biochemical activity of the compounds was assayed in the following assay buffer (50 mM MOPS pH7.5, 100 mM NaCl, 2.5 mM MgCl2, 0.01% T...
US Patent US9505749 (2016)
BindingDB Entry DOI: 10.7270/Q2FN154F