BDBM259861 US9505766, 66
SMILES: Cc1ccc(cc1)-c1c(\C=C(/C#N)C(=O)NC(C)(CO)CO)n(CCCO)c2ncnc(N)c12
InChI Key: InChIKey=WSGWSTKGKSCAAH-LICLKQGHSA-N
Data: 1 IC50
Activity Spreadsheet -- Enzyme Inhibition Constant Data from BindingDB
Found 1 hit for monomerid = 259861
Trg + Lig
Ki
nM
ΔG°
kcal/mole
IC50
nM
Kd
nM
EC50/IC50
nM
koff
s-1
kon
M-1s-1
pHTemp
°C
Ribosomal protein S6 kinase alpha-3 [399-740]
(Homo sapiens (Human))
BDBM259861
(US9505766, 66)
Show SMILES Cc1ccc(cc1)-c1c(\C=C(/C#N)C(=O)NC(C)(CO)CO)n(CCCO)c2ncnc(N)c12
Show InChI InChI=1S/C24H28N6O4/c1-15-4-6-16(7-5-15)19-18(10-17(11-25)23(34)29-24(2,12-32)13-33)30(8-3-9-31)22-20(19)21(26)27-14-28-22/h4-7,10,14,31-33H,3,8-9,12-13H2,1-2H3,(H,29,34)(H2,26,27,28)/b17-10+
US Patent
n/an/a 3.60n/an/an/an/a8.022
THE REGENTS OF THE UNIVERSITY OF CALIFORNIA
US Patent
Assay Description
RSK2 CTD and His6-ERK2 were expressed and purified as described (Cohen et al., Science, 308: 1318). The C436V mutant of RSK2 CTD was generated by Qui...
US Patent US9505766 (2016)
BindingDB Entry DOI: 10.7270/Q2639NPR