BDBM25987 N-[(4-methanesulfonamidophenyl)methyl]-4-[2-methyl-5-(5-methyl-1,3,4-oxadiazol-2-yl)phenyl]benzamide::benzyl amide analog., 8
SMILES: Cc1nnc(o1)-c1ccc(C)c(c1)-c1ccc(cc1)C(=O)NCc1ccc(NS(C)(=O)=O)cc1
InChI Key: InChIKey=CFEHGVYGSPBBGT-UHFFFAOYSA-N
Data: 1 KI  1 IC50
Activity Spreadsheet -- Enzyme Inhibition Constant Data from BindingDB
Found 1 hit for monomerid = 25987
Trg + Lig
Ki
nM
ΔG°
kcal/mole
IC50
nM
Kd
nM
EC50/IC50
nM
koff
s-1
kon
M-1s-1
pHTemp
°C
Mitogen-activated protein kinase 14
(Homo sapiens (Human))
BDBM25987
(N-[(4-methanesulfonamidophenyl)methyl]-4-[2-methyl...)
Show SMILES Cc1nnc(o1)-c1ccc(C)c(c1)-c1ccc(cc1)C(=O)NCc1ccc(NS(C)(=O)=O)cc1
Show InChI InChI=1S/C25H24N4O4S/c1-16-4-7-21(25-28-27-17(2)33-25)14-23(16)19-8-10-20(11-9-19)24(30)26-15-18-5-12-22(13-6-18)29-34(3,31)32/h4-14,29H,15H2,1-3H3,(H,26,30)
NCI pathway
Reactome pathway
40 -9.98 280n/an/an/an/a7.522
GSK
Assay Description
Fluorescence polarization assays used GST-tagged enzyme and an ATP-competitive Rhodamine-green labelled fluoroligand. These components were dissolved...
Bioorg Med Chem Lett 18: 324-8 (2008)
Article DOI: 10.1016/j.bmcl.2007.10.043
BindingDB Entry DOI: 10.7270/Q2FX77RC