BDBM2599 (Arylindolyl)maleimide deriv. 21::3-(1-benzothiophen-3-yl)-4-(1-methyl-1H-indol-3-yl)-2,5-dihydro-1H-pyrrole-2,5-dione
SMILES: Cn1cc(C2=C(C(=O)NC2=O)c2csc3ccccc23)c2ccccc12
InChI Key: InChIKey=MXXPGFCRIISOJY-UHFFFAOYSA-N
Data: 2 IC50
Activity Spreadsheet -- Enzyme Inhibition Constant Data from BindingDB
Found 2 hits for monomerid = 2599
Trg + Lig
Ki
nM
ΔG°
kcal/mole
IC50
nM
Kd
nM
EC50/IC50
nM
koff
s-1
kon
M-1s-1
pHTemp
°C
cAMP-Dependent Protein Kinase (PKA)
(Bos taurus (bovine))
BDBM2599
((Arylindolyl)maleimide deriv. 21 | 3-(1-benzothiop...)
Show SMILES Cn1cc(C2=C(C(=O)NC2=O)c2csc3ccccc23)c2ccccc12 |t:4|
Show InChI InChI=1S/C21H14N2O2S/c1-23-10-14(12-6-2-4-8-16(12)23)18-19(21(25)22-20(18)24)15-11-26-17-9-5-3-7-13(15)17/h2-11H,1H3,(H,22,24,25)
n/an/a>1.00E+5n/an/an/an/an/an/a
Roche Products Limited
Assay Description
The activity of PKA, activated by cAMP, is measured by its ability to transfer phosphate from [gamma-32P]ATP to histone.
J Med Chem 35: 177-84 (1992)
Article DOI: 10.1021/jm00079a024
BindingDB Entry DOI: 10.7270/Q2K64G8V
Protein Kinase C
(Rattus norvegicus (rat))
BDBM2599
((Arylindolyl)maleimide deriv. 21 | 3-(1-benzothiop...)
Show SMILES Cn1cc(C2=C(C(=O)NC2=O)c2csc3ccccc23)c2ccccc12 |t:4|
Show InChI InChI=1S/C21H14N2O2S/c1-23-10-14(12-6-2-4-8-16(12)23)18-19(21(25)22-20(18)24)15-11-26-17-9-5-3-7-13(15)17/h2-11H,1H3,(H,22,24,25)
n/an/a 900n/an/an/an/an/an/a
Roche Products Limited
Assay Description
The activity of PKC, activated by phosphatidylerine and Ca2+, is measured by its ability to transfer phosphate from [gamma-32P]ATP to lysine-rich his...
J Med Chem 35: 177-84 (1992)
Article DOI: 10.1021/jm00079a024
BindingDB Entry DOI: 10.7270/Q2K64G8V