null
SMILES: FC(F)CCOc1ccc(cc1F)[C@H]1COC(=O)N1c1ccc2[nH]cnc2c1
InChI Key:
Activity Spreadsheet -- Enzyme Inhibition Constant Data from BindingDB
Found 2 hits for monomerid = 259908
Trg + Lig
Ki
nM
ΔG°
kcal/mole
IC50
nM
Kd
nM
EC50/IC50
nM
koff
s-1
kon
M-1s-1
pHTemp
°C
Glutaminyl-peptide cyclotransferase
(Homo sapiens (Human))
BDBM259908
(US9512115, 12)
Show SMILES FC(F)CCOc1ccc(cc1F)[C@H]1COC(=O)N1c1ccc2[nH]cnc2c1 |r|
US Patent
13.1 -10.9n/an/an/an/an/a6.030
PROBIODRUG AG
US Patent
Assay Description
All measurements were performed with a BioAssay Reader HTS-7000Plus for microplates (Perkin Elmer) at 30° C. QC activity was evaluated fluorometr...
US Patent US9512115 (2016)
BindingDB Entry DOI: 10.7270/Q2XK8DG4
Glutaminyl-peptide cyclotransferase
(Homo sapiens (Human))
BDBM259908
(US9512115, 12)
Show SMILES FC(F)CCOc1ccc(cc1F)[C@H]1COC(=O)N1c1ccc2[nH]cnc2c1 |r|
US Patent
15.4 -10.8n/an/an/an/an/a8.030
PROBIODRUG AG
US Patent
Assay Description
All measurements were performed with a BioAssay Reader HTS-7000Plus for microplates (Perkin Elmer) at 30° C. QC activity was evaluated fluorometr...
US Patent US9512115 (2016)
BindingDB Entry DOI: 10.7270/Q2XK8DG4